program: Gaussian 09
title: 000180210
version: EM64L-G09RevD.01
frameworkgroup: C1[X(C27H26O3)]
method: RPBEPBE
basis: SDD
operation: Freq
keyword: #pfreq=noraman
keyword: PBEPBE/SDD
title: #p freq=noraman PBEPBE/SDD
converged: YES YES NO NO
title: Mulliken charges:
elementType: O O O C C C C C C C C C C C C C C C C C C C C C C C C C C C H H H H H H H H H H H H H H H H H H H H H H H H H H
charge: -0.412552 -0.416742 -0.439320 0.266503 0.406184 0.353415 -0.574934 -0.148018 0.123907 0.202767 -0.523283 -0.596051 -0.569241 -0.529138 0.530202 0.117668 0.527057 0.125106 -0.459183 -0.383771 -0.468017 -0.397778 -0.645906 -0.646972 -0.030253 -0.032650 -0.024007 -0.603445 -0.578786 -0.588630 0.261947 0.283100 0.226986 0.243755 0.306244 0.256420 0.236003 0.216722 0.232677 0.210370 0.214288 0.224868 0.211032 0.221009 0.224608 0.376777 0.232209 0.230602 0.355446 0.353976 0.209915 0.218328 0.218522 0.218964 0.213132 0.217967
chargesum: 0.00000
title: Mulliken charges with hydrogens summed into heavy atoms:
elementType: O O O C C C C C C C C C C C C C C C C C C C C C C C C C C C
charge: -0.035775 -0.061296 -0.085344 0.266503 0.406184 0.353415 -0.312987 -0.148018 0.123907 0.202767 -0.240182 -0.125309 -0.262997 -0.272718 0.530202 0.117668 0.527057 0.125106 -0.223180 -0.167049 -0.235341 -0.187408 -0.206751 -0.214932 0.194355 0.199559 0.206596 -0.175202 -0.141299 -0.157531
polarizability: 4.01065075e+02 -2.62174358e+01 3.52639367e+02 -1.74252532e+01 -3.65699774e+00 2.25155859e+02
1716.lowfreq: -5.4887 -3.1808 -2.2399 -0.0005 0.0004 0.0008 11.5142 15.9579 19.5267
frequency: 11.2195 15.8763 19.4669 27.5990 29.0066 43.5606 50.3802 56.5755 62.8416 68.1434 82.0821 101.0153 108.4664 112.6076 135.4053 152.7047 162.5169 194.5739 209.6618 223.4399 243.1132 264.3262 278.8371 293.1916 310.5709 320.7454 340.6137 346.3003 354.5725 360.3316 369.9140 372.7322 385.7096 385.9102 393.1152 449.3526 450.7177 462.5837 475.5357 484.9100 485.9585 492.9990 525.9732 546.9484 566.0799 572.6181 595.8288 618.2567 627.4775 639.5578 647.3613 656.0850 686.7041 721.6370 739.1842 748.2947 762.2624 771.1676 778.0525 799.6372 803.7469 812.0467 836.3545 887.2912 889.8498 892.7829 904.7552 921.0837 923.7376 928.9540 931.9993 932.1505 934.6108 936.7170 943.1944 945.0787 949.5939 950.4598 957.1225 970.7020 1011.2858 1012.1067 1013.0314 1055.4681 1060.1657 1094.6887 1105.1193 1112.1506 1116.3268 1122.1169 1158.9942 1161.8207 1175.5969 1183.5850 1199.0550 1209.4205 1212.7352 1218.8715 1222.6622 1236.8368 1244.8805 1259.9553 1271.7276 1277.5482 1278.3058 1287.1704 1288.4009 1290.0062 1301.0523 1306.7091 1322.9817 1344.2117 1367.8939 1376.4242 1381.2591 1395.6942 1416.5927 1423.7312 1424.3858 1425.2021 1437.1970 1450.0872 1455.2103 1458.7145 1463.4992 1499.1175 1501.7397 1593.9615 1596.9068 1600.3023 1607.8197 1609.9236 1617.2518 1654.1276 1654.7887 1657.7634 2964.8903 2967.7605 2975.1138 3016.2082 3019.3814 3024.4728 3078.1457 3081.4902 3082.2460 3091.9520 3094.9878 3094.9977 3102.5963 3106.7484 3122.8328 3132.7023 3137.2365 3137.9096 3156.7721 3170.5372 3192.6510 3194.3825 3197.3940 3497.9977 3573.2207 3574.4235
redmass: 3.9900 4.1556 3.5980 4.0680 3.5631 4.3506 3.1827 3.9537 4.0507 3.3536 4.8690 3.3329 3.1519 3.4268 3.2780 4.2589 3.9005 3.6192 4.5347 3.6670 4.5111 4.2168 4.3475 3.9762 4.6308 4.3153 3.5533 1.2582 3.0533 3.0829 1.1856 4.4476 2.7776 2.8345 2.6707 3.5318 3.1849 3.3332 1.6242 2.7864 2.5002 2.1576 2.6633 2.6243 3.4247 3.2841 3.2570 2.2824 3.1983 3.0017 3.8291 3.7072 3.2720 3.9236 3.7813 4.7620 3.9970 3.0815 3.3397 2.2481 2.0874 2.2234 4.0808 1.5809 1.5598 1.5583 1.5352 1.8238 1.5801 1.3861 1.3961 1.9294 2.1147 1.4222 1.5442 1.4967 1.4193 1.5542 2.3445 2.4349 1.1501 1.1427 1.1620 2.9853 2.8285 1.9114 1.7633 1.6752 1.6412 1.7712 1.4067 1.2744 1.7306 1.4619 1.7414 1.4175 1.3685 1.4117 2.2559 2.5458 2.7743 1.7957 1.5276 1.3215 1.3250 1.2572 1.2592 1.2396 1.6397 1.6802 1.4183 3.5741 3.4591 5.2226 6.2876 3.7008 3.3746 1.2042 1.2007 1.2291 3.2608 1.7832 1.1026 1.1264 1.7297 3.0940 3.1597 6.0997 6.6289 6.6079 6.2917 6.3276 6.6885 4.6656 4.6796 4.7587 1.0592 1.0593 1.0608 1.1001 1.1002 1.0974 1.0685 1.0643 1.0677 1.0844 1.0881 1.0872 1.0878 1.0881 1.0910 1.0917 1.0946 1.0960 1.0912 1.0918 1.1143 1.1143 1.1143 1.0649 1.0660 1.0659
irintensity: 0.0238 0.1139 0.1645 0.4332 0.0370 0.5648 0.2203 0.3831 0.7081 1.0959 0.0266 0.0612 0.0960 0.0237 0.1915 1.0485 0.3642 1.4767 0.4335 0.2938 3.1132 2.1411 5.4352 0.5871 3.3608 1.8438 3.9139 86.5007 18.5732 7.1558 101.6730 1.5204 1.5762 1.6572 4.3179 20.3412 20.0178 11.9672 44.1826 0.7377 7.9797 31.5114 7.1411 6.9103 19.0665 1.2314 77.7092 5.5805 1.2754 14.8593 8.1208 9.3103 8.9133 2.5766 2.3936 0.7496 3.8186 13.8818 12.2950 8.7112 51.6773 30.7749 0.9580 10.0968 0.3257 20.0711 16.6821 8.8582 13.7290 0.8142 1.6448 24.2674 9.8684 28.8285 24.9240 88.0999 36.2703 50.0734 10.3669 17.8395 27.7267 24.1856 16.9075 38.9395 95.8433 57.5668 49.1892 0.9550 80.7282 9.1026 13.8831 33.9014 79.5904 40.3628 8.8676 21.0471 5.3217 10.5973 17.7853 28.4286 27.7714 71.1143 32.1154 27.7495 29.5610 12.6478 17.7675 9.6998 21.4524 7.1315 11.4087 7.2366 11.7196 28.8444 10.0450 18.9355 27.9185 5.0061 8.1968 10.3720 12.4217 51.8297 25.7742 14.4562 77.5355 77.3409 23.4950 0.2907 0.1244 0.0085 4.6850 21.4475 4.3641 17.9966 16.3508 22.8338 39.3256 34.6788 18.9480 14.3308 13.0418 6.0861 19.4295 16.6141 19.1344 8.2973 4.0008 9.8043 19.7930 16.1622 4.8732 22.2277 9.0986 19.6554 3.8396 0.4391 29.3380 26.3091 23.6748 95.8877 35.2060 27.8987
temp: 298.150 k
press: 1.00000 atm
elementType: 8 8 8 6 6 6 6 6 6 6 6 6 6 6 6 6 6 6 6 6 6 6 6 6 6 6 6 6 6 6 1 1 1 1 1 1 1 1 1 1 1 1 1 1 1 1 1 1 1 1 1 1 1 1 1 1
symmnumber: 1
zpe: 1175080.8 jmol-1
zpe.correction: 0.447565 hartree
zpe.thermalcorrener: 0.477084 hartree
zpe.thermalcorrenthalpy: 0.478028 hartree
zpe.thermalcorrgfe: 0.382852 hartree
zpe.sumelectzpe: -1267.951215 hartree
zpe.sumelectthermal: -1267.921696 hartree
zpe.sumelectthermalent: -1267.920752 hartree
zpe.sumelectthermalfe: -1268.015928 hartree
dipole: 0.1782 -3.0412 1.4797
dipole: 3.3868
quadrupole: -147.5936 -170.4968 -166.0878
quadrupole: -14.9290 -0.0425 -5.7105
quadrupole: 13.7991 -9.1041 -4.6951 -14.9290 -0.0425 -5.7105
hfenergy: -1268.3987795 hartree
pointgroup: C01 [X(C27H26O3)]
dipole: -0.1063941 1.082791 -0.7692267 debye
polarizability: 387.077471|37.1275991|360.7232894|23.2530828|-19.1639249|231.0595401 unknown
InChI: InChI=1S/C27H26O3/c1-4-7-18-10-12-25(28)22(14-18)21-16-20(9-6-3)27(30)24(17-21)23-15-19(8-5-2)11-13-26(23)29/h4-6,10-17,28-30H,1-3,7-9H2
charge 0 multiplicity 1
56 atoms
O  2.914564 -1.697565 0.140728
O  0.91116 1.35888 -2.733311
O  -3.257076 -2.94087 -0.765643
C  1.043694 -0.121223 -0.271792
C  -1.266635 -0.96105 0.022135
C  0.656048 -2.455404 0.476609
C  -0.356386 0.067639 -0.326689
C  1.536884 -1.400003 0.121478
C  1.99634 0.98229 -0.601508
C  -2.733381 -0.689216 0.004631
C  -0.732173 -2.217022 0.421607
C  1.22571 -3.817095 0.870574
C  3.019077 1.34644 0.31618
C  -3.223758 0.592225 0.373138
C  3.955281 2.378927 0.055561
C  1.922842 1.713882 -1.823845
C  -4.597646 0.931342 0.366958
C  -3.707248 -1.66159 -0.376724
C  3.857701 3.071258 -1.174121
C  2.847083 2.746453 -2.104088
C  -5.529191 -0.059204 -0.02344
C  -5.085006 -1.347087 -0.389458
C  5.015702 2.75219 1.093286
C  -5.062482 2.321138 0.807509
C  0.367407 -4.590324 1.850366
C  5.786873 1.558622 1.629916
C  -4.3147 3.456578 0.130954
C  -0.064188 -5.864831 1.677192
C  5.874435 1.214906 2.939334
C  -3.657919 4.451806 0.778593
H  -0.734817 1.032813 -0.676306
H  -1.411387 -3.031908 0.684713
H  1.387316 -4.427254 -0.040854
H  2.231546 -3.655854 1.305042
H  3.058972 0.834295 1.285836
H  -2.500632 1.350823 0.694734
H  4.568002 3.873179 -1.407383
H  2.781086 3.294837 -3.053367
H  -6.601427 0.169492 -0.037001
H  -5.813174 -2.111786 -0.692788
H  5.725052 3.468599 0.631809
H  4.542498 3.281929 1.944107
H  -6.145092 2.41686 0.586624
H  -4.955046 2.428735 1.905514
H  0.106611 -4.056148 2.777686
H  3.435233 -0.906289 -0.159252
H  6.302206 0.945775 0.874284
H  -4.323011 3.440675 -0.9698
H  0.987074 1.892266 -3.56358
H  -4.018124 -3.48993 -1.079644
H  -0.656843 -6.380554 2.441341
H  0.16425 -6.428193 0.763398
H  6.452373 0.344109 3.26793
H  5.368888 1.796897 3.720565
H  -3.142998 5.251191 0.233944
H  -3.61797 4.494551 1.874623
