program: Gaussian 09
title: 000180206
version: EM64L-G09RevD.01
frameworkgroup: C1[X(C28H22N2O7)]
method: RPBEPBE
basis: SDD
operation: Freq
keyword: #p
keyword: freq=noraman
keyword: PBEPBE/SDD
title: #p freq=noraman PBEPBE/SDD
converged: YES YES NO NO
title: Mulliken charges:
elementType: O O O O O O O N N C C C C C C C C C C C C C C C C C C C C C C C C C C C C H H H H H H H H H H H H H H H H H H H H H H
charge: -0.270056 -0.254509 -0.190712 -0.235466 -0.258026 -0.259980 -0.434384 -0.239627 0.155153 -0.393681 -0.110497 0.281319 0.091835 0.291166 0.269324 -0.612797 -0.035904 0.267916 -0.673229 -0.392506 -0.436374 0.448011 0.140901 0.514854 -0.372236 -0.525102 -0.498113 -0.572661 -0.205242 0.170692 0.168214 -0.386251 -0.383419 -0.205269 -0.387301 -0.348831 0.283269 0.295030 0.306409 0.243323 0.246848 0.243063 0.259579 0.224814 0.236058 0.222711 0.253382 0.241523 0.299232 0.264160 0.245786 0.233344 0.247934 0.234139 0.241816 0.237738 0.219273 0.249445 0.353906
chargesum: 0.00000
title: Mulliken charges with hydrogens summed into heavy atoms:
elementType: O O O O O O O N N C C C C C C C C C C C C C C C C C C C C C C C C C C C C
charge: -0.270056 -0.254509 -0.190712 -0.235466 -0.258026 -0.259980 -0.080478 -0.239627 0.155153 -0.098651 0.195912 0.281319 0.091835 0.291166 0.269324 -0.122625 -0.035904 0.267916 0.054228 -0.156449 -0.213662 0.448011 0.140901 0.514854 -0.118854 -0.283579 -0.198882 -0.308501 0.273888 0.170692 0.168214 -0.138317 -0.149280 0.274285 -0.168028 -0.099386 0.283269
polarizability: 4.55532514e+02 -9.12612442e+01 3.45350504e+02 -1.26501226e+01 -3.42661461e+01 3.07872681e+02
1716.lowfreq: -1.7605 -0.0008 -0.0004 0.0007 3.8931 8.5367 17.2807 19.0480 25.2967
frequency: 17.2252 19.0115 25.2682 33.8384 38.1307 48.3389 62.6311 64.3605 69.7115 75.1387 81.8379 101.4206 104.3678 127.9142 137.1946 139.9687 165.6114 171.9432 194.5059 197.1131 206.5401 229.8275 245.2156 252.3229 281.4800 288.1546 296.0751 317.3247 321.1815 354.4044 356.0931 366.1585 401.0973 403.3073 411.5630 417.3746 424.6074 430.9704 449.7407 470.1266 483.7297 493.8980 526.2660 529.2435 538.9643 561.1254 566.2683 576.4007 604.1090 616.1960 635.9125 644.4845 646.3661 664.7688 667.9957 678.2523 693.1152 701.9223 714.8879 722.8549 736.9696 748.5935 761.4749 779.2277 787.8499 793.2547 803.7359 807.1276 811.2774 820.3919 824.1696 825.5787 836.8466 838.9786 852.4183 877.7688 891.0317 904.0465 931.8083 933.0246 949.9132 954.4858 957.0604 959.9129 963.5080 974.9275 984.6207 1004.6555 1008.5310 1034.0060 1050.8212 1069.6004 1070.7089 1074.2186 1097.8174 1103.8980 1110.2902 1126.8687 1130.0688 1136.7160 1140.1320 1144.2328 1170.8995 1178.9727 1182.1623 1186.6013 1209.2936 1214.1208 1218.7990 1226.5524 1242.2867 1248.9271 1249.0220 1251.7539 1255.2216 1284.6300 1292.0861 1305.7786 1320.3214 1330.1031 1334.2680 1357.1733 1362.4483 1365.1207 1379.8569 1393.7247 1401.2697 1410.6436 1428.0181 1429.7088 1432.7416 1447.0235 1455.8517 1457.0267 1461.0568 1467.3589 1476.7090 1481.5730 1482.3621 1487.9627 1506.2169 1528.0570 1585.6347 1598.7358 1603.5088 1624.9035 1628.1630 1635.0937 1639.4745 2935.6624 2996.0595 3005.7644 3011.6367 3037.1370 3042.8825 3066.5812 3082.4220 3108.7825 3111.7160 3113.1444 3120.7092 3122.6222 3127.9465 3140.9938 3152.1450 3160.0177 3169.2512 3170.2206 3184.4619 3192.0408 3583.1720
redmass: 7.3872 5.5714 4.6836 7.0677 6.0479 4.5512 4.4615 7.3623 7.5028 3.2331 2.9403 5.2198 4.7272 3.0460 6.6149 5.8125 5.7366 6.2537 2.1335 2.4349 3.8428 7.9469 7.3379 6.3306 4.6281 6.7063 5.9582 2.6472 5.0750 4.5325 1.2199 6.1737 5.3061 3.0551 2.9763 3.6059 5.4356 5.8281 5.6299 5.2446 5.4608 5.1368 5.1483 5.0441 3.3088 6.5222 4.9544 4.5364 5.2933 6.3635 6.2988 4.8712 5.8629 6.5759 5.0790 8.9527 8.9357 4.8957 5.6593 4.1069 6.8048 5.4136 4.5200 6.8082 3.7759 5.0172 2.9520 1.4325 1.4855 4.4796 2.4223 2.8205 2.0664 7.0164 7.3005 1.6145 3.9478 1.4613 1.5046 1.4096 3.7000 2.3919 1.5579 1.3671 2.9483 4.8574 5.5343 2.9620 3.9012 3.3690 3.4558 2.0403 2.0146 1.5482 2.7885 1.4781 1.3405 1.0595 1.3886 1.2413 2.2392 1.3984 1.4425 1.7426 1.1267 1.8718 1.7807 1.7633 2.2872 1.7462 2.8354 2.4328 2.7415 2.2772 2.6476 1.4805 3.6388 1.7069 1.3216 1.8749 1.4827 1.7560 1.3100 1.8910 2.1132 5.8511 4.3008 4.5672 2.3816 2.5822 2.5409 2.8744 1.5819 1.9457 2.8943 2.3116 1.1724 1.1844 1.2215 1.0898 2.7694 4.6942 8.2117 6.4279 8.6413 8.2001 6.4246 9.0649 8.4282 1.0470 1.0629 1.0600 1.0596 1.0851 1.0879 1.0943 1.0938 1.0987 1.1112 1.0882 1.0901 1.1081 1.0866 1.0962 1.0959 1.0886 1.0932 1.0951 1.0963 1.0925 1.0660
irintensity: 0.3153 0.1599 0.3747 1.2092 2.5682 1.0525 0.4725 1.0848 0.4417 4.9269 10.5518 1.3925 8.1453 7.6328 2.9751 5.3896 0.6474 0.9328 0.8460 2.2149 0.6082 0.2753 2.1641 3.0436 0.8580 3.0195 1.7688 2.8131 5.4582 11.8056 125.1973 1.2877 3.9841 9.0265 0.6968 18.3821 6.9179 5.0945 3.4627 9.1710 4.6426 14.2758 12.5933 8.1481 18.6997 1.6049 2.4525 3.4563 10.0247 3.0198 1.5680 4.2730 3.2952 3.1873 3.8504 1.1649 2.7577 4.8603 2.4325 0.5246 3.9859 1.2636 16.4682 5.3608 17.1641 18.0700 15.9824 41.5789 37.0867 24.3201 36.1804 13.9001 49.5109 13.2953 13.3724 47.1757 9.9629 26.2464 0.6075 0.2897 39.3889 41.7677 10.0893 0.2118 25.7232 145.3939 140.4686 3.3174 3.5442 3.2617 0.3278 25.5475 39.2704 22.5236 28.3779 60.1346 13.4978 1.1422 2.3829 1.7530 64.5078 188.2925 40.5100 122.1317 7.1803 8.4815 4.5516 22.8026 0.1309 2.9617 0.0560 190.9676 34.1351 46.2936 160.2143 37.4450 66.7196 35.2611 11.6008 15.3896 12.6066 12.2196 1.2965 8.8559 33.1289 17.8694 6.4747 6.8642 26.2521 9.8344 61.8128 214.3087 14.6403 147.7666 103.3853 141.4356 1.3845 8.8054 13.2374 12.1308 99.8293 8.5789 4.1486 10.0325 9.3867 3.4285 37.3054 0.7510 5.5385 79.8931 144.5745 150.5553 10.9084 1.3905 20.3299 0.6863 4.0734 11.9213 32.3162 19.6119 14.4281 24.4794 4.7406 7.8218 13.4904 11.6890 6.5630 5.5128 7.9871 2.8896 43.0277
temp: 298.150 k
press: 1.00000 atm
elementType: 8 8 8 8 8 8 8 7 7 6 6 6 6 6 6 6 6 6 6 6 6 6 6 6 6 6 6 6 6 6 6 6 6 6 6 6 6 1 1 1 1 1 1 1 1 1 1 1 1 1 1 1 1 1 1 1 1 1 1
symmnumber: 1
zpe: 1163625.6 jmol-1
zpe.correction: 0.443202 hartree
zpe.thermalcorrener: 0.474266 hartree
zpe.thermalcorrenthalpy: 0.475210 hartree
zpe.thermalcorrgfe: 0.378476 hartree
zpe.sumelectzpe: -1713.537369 hartree
zpe.sumelectthermal: -1713.506305 hartree
zpe.sumelectthermalent: -1713.505361 hartree
zpe.sumelectthermalfe: -1713.602094 hartree
dipole: 0.9701 -2.3734 -0.4665
dipole: 2.6061
quadrupole: -195.3685 -196.4229 -208.3690
quadrupole: -5.4049 -9.2198 -3.2153
quadrupole: 4.6850 3.6305 -8.3155 -5.4049 -9.2198 -3.2153
hfenergy: -1713.9805708 hartree
pointgroup: C01 [X(C28H22N2O7)]
dipole: 0.3879544 -0.9218477 -0.2257671 debye
polarizability: 456.8229108|-89.9289822|346.7288247|-17.1929736|-32.1317465|305.2039634 unknown
InChI: InChI=1S/C28H22N2O7/c1-29-26-19(7-4-16-11-23-24(12-20(16)26)36-13-35-23)18-8-9-22-28(37-14-34-22)25(18)27(29)21(30(32)33)10-15-2-5-17(31)6-3-15/h2-9,11-12,21,27,31H,10,13-14H2,1H3
charge 0 multiplicity 1
59 atoms
O  3.372235 -2.326992 -1.67413
O  4.196962 -4.132436 -0.333346
O  -0.400099 2.431049 -0.890831
O  0.746291 1.652521 -2.699232
O  -5.428559 1.60382 -1.474731
O  -6.634682 1.110803 0.535185
O  4.089856 5.810763 1.90617
N  -0.775087 -0.900431 -1.274079
N  0.428322 1.628411 -1.448202
C  0.700399 -0.823218 -1.178012
C  1.108495 0.560704 -0.578459
C  1.25234 -1.97517 -0.352238
C  -1.456165 -1.094109 -0.027282
C  0.489738 -2.449422 0.769643
C  -0.829025 -1.824944 1.018089
C  2.638976 0.810932 -0.577129
C  2.444427 -2.638515 -0.640448
C  -2.770974 -0.527316 0.150406
C  -1.291151 -1.61537 -2.468667
C  0.993053 -3.526149 1.551714
C  -1.531711 -2.001685 2.255324
C  -3.483714 -0.784091 1.389335
C  2.931383 -3.700982 0.146282
C  3.038884 2.136294 0.052711
C  2.226874 -4.163019 1.261093
C  -2.825558 -1.519884 2.428323
C  -3.366745 0.310185 -0.861046
C  -4.809821 -0.257636 1.589979
C  4.352081 -3.447689 -1.642754
C  -4.638459 0.792081 -0.624011
C  -5.356257 0.504977 0.576241
C  3.23159 3.294269 -0.740592
C  3.210137 2.248678 1.458164
C  -6.61834 1.979342 -0.671654
C  3.580742 4.530383 -0.154658
C  3.55814 3.473205 2.059809
C  3.740955 4.617023 1.248729
H  1.110383 -0.858252 -2.203633
H  0.674792 0.70363 0.425551
H  2.996316 0.740957 -1.62033
H  3.093088 -0.026891 -0.01857
H  -0.959456 -1.095823 -3.384976
H  -2.391941 -1.619989 -2.449313
H  -0.946464 -2.671547 -2.507695
H  0.400086 -3.910483 2.386262
H  -1.043282 -2.530822 3.080049
H  2.604701 -4.98636 1.871993
H  -3.351853 -1.681562 3.375678
H  -2.804401 0.588048 -1.753999
H  -5.350216 -0.451048 2.520275
H  5.369098 -3.036092 -1.715759
H  4.108502 -4.159575 -2.454787
H  3.104284 3.232765 -1.82784
H  3.074139 1.363335 2.091969
H  -7.526311 1.786521 -1.263053
H  -6.521826 3.034124 -0.353519
H  3.72401 5.416717 -0.786518
H  3.69259 3.563817 3.141639
H  4.172826 6.556046 1.260877
