program: Gaussian 09
title: 000180182
version: EM64L-G09RevD.01
frameworkgroup: C1[X(C22H17ClN2O3)]
method: RPBEPBE
basis: SDD
operation: Freq
keyword: #p
keyword: freq=noraman
keyword: PBEPBE/SDD
title: #p freq=noraman PBEPBE/SDD
converged: YES YES NO NO
title: Mulliken charges:
elementType: Cl O O O N N C C C C C C C C C C C C C C C C C C C C C C H H H H H H H H H H H H H H H H H
charge: -0.051706 -0.296596 -0.311616 -0.292493 -0.370961 0.005271 0.537399 -0.192975 -0.526168 -0.522886 0.502470 0.346395 -0.439543 -0.390384 -0.197582 -0.431337 -0.355232 0.321221 0.348960 -0.199717 -0.207427 -0.107823 -0.193791 -0.356161 -0.385865 -0.201193 -0.193656 -0.247763 0.290676 0.267940 0.235711 0.288104 0.269345 0.263366 0.234829 0.334387 0.239211 0.251559 0.258040 0.259155 0.265763 0.257221 0.232996 0.230795 0.232063
chargesum: 0.00000
title: Mulliken charges with hydrogens summed into heavy atoms:
elementType: Cl O O O N N C C C C C C C C C C C C C C C C C C C C C C
charge: -0.051706 -0.296596 -0.311616 -0.292493 -0.036574 0.005271 0.537399 0.097700 -0.022517 -0.234782 0.502470 0.346395 -0.170198 -0.127018 0.037246 -0.192126 -0.103673 0.321221 0.348960 0.058323 0.051728 -0.107823 -0.193791 -0.090398 -0.128644 0.031803 0.037139 -0.015700
polarizability: 3.29649036e+02 1.11062069e+01 2.69042892e+02 4.43978229e+00 -2.22861962e+01 2.14807668e+02
1716.lowfreq: -6.5075 -2.9066 -0.0021 -0.0011 -0.0009 3.5446 7.4371 12.1072 13.9912
frequency: 6.8265 11.1812 13.8341 24.0623 32.3677 33.0478 46.3205 57.2918 61.7945 89.3053 99.7801 125.1284 143.5436 175.3650 191.0517 214.6720 223.6641 240.0951 267.0321 280.9189 300.4507 315.2569 324.1796 346.4639 376.9470 395.5767 409.7336 410.1792 422.3206 454.6389 459.0296 478.7478 509.8428 548.7077 562.7107 592.6327 607.5951 611.7671 621.9790 625.9006 629.7495 642.5649 681.1282 689.6787 691.4186 702.2826 715.1377 733.6346 765.5797 796.4419 804.9822 822.8319 828.3470 832.9652 835.8394 863.2148 897.7510 900.6388 913.7262 916.7831 949.6265 958.7708 969.3859 969.5654 984.0507 986.3781 987.2063 989.4389 996.1565 1000.8005 1019.6501 1020.3455 1072.4133 1077.9557 1083.7990 1089.3132 1114.2385 1141.0927 1167.8300 1173.4280 1178.1131 1184.2389 1193.2694 1195.8374 1213.1161 1235.6913 1241.6195 1282.0857 1282.3167 1296.3822 1308.0984 1330.5896 1342.4441 1382.0561 1384.4882 1392.3224 1402.7727 1440.7103 1447.0968 1470.5361 1471.0702 1478.4859 1482.0767 1489.4370 1589.4227 1594.6606 1595.8785 1603.2986 1605.5004 1613.8650 1672.0800 2204.9033 2988.8713 3008.2793 3048.6120 3128.6817 3133.5183 3141.2400 3141.4134 3142.5971 3152.0583 3157.1875 3158.3438 3166.2889 3170.2606 3173.1597 3175.3696 3175.7000 3560.9229
redmass: 9.0125 7.1715 6.2049 4.5053 5.0734 6.4806 5.2444 5.3544 10.6037 8.8565 8.9642 5.9256 5.8796 6.2907 7.1908 4.9923 5.4028 6.0045 6.9618 5.1203 5.8366 4.7513 7.0778 4.0165 5.3732 7.3746 2.9058 2.9491 5.9970 3.8564 3.6085 3.4753 3.9390 4.9270 7.6213 3.8695 1.8670 5.5904 5.0146 5.9979 6.3127 3.1691 6.6320 5.0529 2.6450 2.5388 3.6978 4.0529 1.7991 2.6650 1.7969 3.6655 1.7681 1.2513 1.3198 4.2255 2.9660 1.8175 1.4337 1.4847 1.3851 3.9278 1.3682 1.3751 1.5539 3.5414 4.7006 1.4041 3.8907 4.2261 2.2409 2.2569 2.9755 1.5057 4.4543 1.6469 1.3945 1.9693 1.1766 1.1683 1.1368 1.1729 1.9736 2.1908 2.6293 2.2691 1.3499 1.5777 1.2568 1.2653 1.3477 1.4602 1.7975 8.0694 4.8553 7.5557 2.1288 2.3322 2.5449 1.5003 1.9205 2.5179 1.7178 1.8247 7.2493 6.3191 6.5089 6.1102 6.4474 6.4862 9.7620 12.5973 1.0622 1.0823 1.0996 1.0901 1.0850 1.0873 1.0894 1.0891 1.0922 1.0929 1.0935 1.0965 1.0952 1.0963 1.0989 1.1004 1.0775
irintensity: 0.0773 0.1320 0.5330 0.4262 0.1275 0.9327 0.7853 1.6959 8.8215 1.1412 0.3579 3.9638 2.1376 2.5118 4.1155 1.6584 1.1334 3.3868 11.1227 3.4064 1.3344 3.9258 3.5138 11.2639 4.2038 27.1747 0.3678 0.3001 3.4136 4.5332 7.3702 18.2036 33.8397 3.4073 0.3411 17.6084 100.7445 8.8209 22.1552 1.8701 9.9979 10.2287 7.7498 37.3345 24.3577 18.1704 1.2679 13.4327 95.6870 20.1988 71.6843 18.3257 81.8705 0.4516 5.3293 76.8177 125.2358 91.1238 8.8434 1.6459 4.4855 31.5325 0.1127 2.4467 1.3099 19.7566 1.4231 0.8617 80.3135 20.9838 95.5562 61.7877 63.3963 12.2994 82.0847 4.1884 34.4449 4.0601 30.6389 35.7258 1.5423 38.2963 131.1762 304.3694 1.3457 264.3239 40.3921 78.7565 12.3121 8.2638 1.0060 15.4066 11.7902 7.1686 3.7626 9.8933 14.7394 12.0225 77.7259 89.4151 159.4440 16.4120 88.7899 356.3355 2.2237 20.2567 125.6915 8.4377 44.6329 3.7925 312.4933 1.0047 35.2627 25.8528 6.4039 10.2664 1.6748 6.3887 6.5026 8.3057 6.2167 20.4219 7.3096 12.9352 5.8717 0.3162 11.4594 4.9373 39.6809
temp: 298.150 k
press: 1.00000 atm
elementType: 17 8 8 8 7 7 6 6 6 6 6 6 6 6 6 6 6 6 6 6 6 6 6 6 6 6 6 6 1 1 1 1 1 1 1 1 1 1 1 1 1 1 1 1 1
symmnumber: 1
zpe: 881378.9 jmol-1
zpe.correction: 0.335700 hartree
zpe.thermalcorrener: 0.360786 hartree
zpe.thermalcorrenthalpy: 0.361730 hartree
zpe.thermalcorrgfe: 0.273324 hartree
zpe.sumelectzpe: -1641.807451 hartree
zpe.sumelectthermal: -1641.782364 hartree
zpe.sumelectthermalent: -1641.781420 hartree
zpe.sumelectthermalfe: -1641.869826 hartree
dipole: -0.3030 1.7047 -3.1335
dipole: 3.5800
quadrupole: -175.6363 -164.8814 -165.1366
quadrupole: 9.0065 -6.0866 0.7776
quadrupole: -7.0849 3.6701 3.4148 9.0065 -6.0866 0.7776
hfenergy: -1642.1431502 hartree
pointgroup: C01 [X(C22H17Cl1N2O3)]
dipole: 0.135167 0.3328605 1.3618935 debye
polarizability: 324.6135326|-22.3498673|260.1182406|8.3699732|31.3453318|228.7678239 unknown
InChI: InChI=1S/C22H17ClN2O3/c23-18-11-9-16(10-12-18)15-25-22(26)28-21(14-24)17-5-4-8-20(13-17)27-19-6-2-1-3-7-19/h1-13,21,25H,15H2
charge 0 multiplicity 1
45 atoms
Cl -9.205268 -0.723065 -0.675167
O  -0.624832 0.372475 -0.491891
O  4.619518 -0.436419 1.415171
O  -1.512724 2.563502 -0.655157
N  -2.597733 0.844757 0.532078
N  1.076345 -1.047833 -3.079602
C  1.729489 1.174515 -0.367292
C  0.558439 0.855385 -1.286844
C  -3.7535 1.638991 0.977012
C  2.641599 0.1674 0.027707
C  -5.090507 1.026446 0.571422
C  3.696443 0.502145 0.905601
C  1.864257 2.498911 0.116488
C  3.839534 1.819667 1.399509
C  2.918085 2.810791 1.004434
C  -6.149427 0.939436 1.507148
C  -5.307032 0.565754 -0.752218
C  -1.593521 1.381188 -0.229889
C  4.935859 -1.634043 0.71445
C  -7.407902 0.41168 1.137346
C  -6.554744 0.031722 -1.139515
C  -7.589205 -0.034794 -0.184722
C  0.840095 -0.205718 -2.269711
C  5.134179 -1.670475 -0.684995
C  5.152907 -2.775299 1.515519
C  5.538776 -2.883884 -1.28492
C  5.56513 -3.978755 0.902096
C  5.754305 -4.039898 -0.498653
H  0.235178 1.774765 -1.814293
H  -3.627102 2.639858 0.523822
H  -3.720104 1.771053 2.075881
H  2.527356 -0.858063 -0.338531
H  1.143958 3.265244 -0.189107
H  4.666553 2.040721 2.080609
H  3.028169 3.831983 1.383636
H  -2.524158 -0.139187 0.796232
H  -5.999205 1.284983 2.537057
H  -4.496427 0.622834 -1.487292
H  -8.224087 0.345267 1.862272
H  -6.7207 -0.32232 -2.160946
H  4.986499 -0.772831 -1.29342
H  5.001243 -2.703183 2.596601
H  5.689343 -2.920208 -2.369211
H  5.73466 -4.867886 1.519081
H  6.068258 -4.976015 -0.971994
