program: Gaussian 09
title: 000180160
version: EM64L-G09RevD.01
frameworkgroup: C1[X(C16H17NO)]
method: RPBEPBE
basis: SDD
operation: Freq
keyword: #p
keyword: freq=noraman
keyword: PBEPBE/SDD
title: #p freq=noraman PBEPBE/SDD
converged: YES YES NO NO
title: Mulliken charges:
elementType: O N C C C C C C C C C C C C C C C C H H H H H H H H H H H H H H H H H
charge: -0.279505 -0.118706 0.063966 -0.502864 -0.407069 0.124693 0.357085 -0.765873 0.144191 -0.397504 -0.619196 0.405769 -0.267156 -0.331079 -0.472510 -0.439646 -0.304581 -0.248486 0.263617 0.221989 0.225050 0.230920 0.214800 0.262882 0.243302 0.278444 0.223387 0.274076 0.228469 0.234623 0.226955 0.237927 0.237747 0.225591 0.228693
chargesum: 0.00000
title: Mulliken charges with hydrogens summed into heavy atoms:
elementType: O N C C C C C C C C C C C C C C C C
charge: -0.279505 -0.118706 0.063966 -0.017258 0.048902 0.124693 0.357085 -0.044890 0.144191 -0.119061 0.106735 0.405769 -0.040201 -0.096456 -0.234583 -0.201898 -0.078990 -0.019793
polarizability: 2.33035156e+02 1.15400212e+01 1.95379377e+02 2.31655331e+00 -2.09891605e+00 1.10510086e+02
1716.lowfreq: -43.6486 -13.6696 -8.3027 -0.0007 -0.0004 -0.0002 8.6983 48.8986 80.1048
frequency: -43.5372 48.8553 80.0852 96.2829 152.4862 156.4619 168.3906 193.4982 196.2915 219.2150 224.7544 274.3978 288.0813 298.1136 319.4186 400.0502 419.3337 444.1092 471.8204 492.2556 514.6927 537.4369 579.1162 624.8817 640.5185 657.0154 675.8692 714.2778 747.1937 764.2452 786.6036 788.7734 813.9721 817.4511 861.2858 878.1975 915.6550 930.2894 951.2968 961.0524 980.8613 986.3168 989.2804 994.2869 1014.6816 1035.0449 1071.3345 1082.1135 1102.3060 1131.2131 1141.1965 1144.6146 1155.6072 1177.0177 1189.9639 1204.2713 1233.0756 1239.4396 1246.3165 1265.9392 1275.5226 1287.4839 1315.5889 1366.9968 1383.7335 1399.1252 1403.7650 1408.8810 1421.4107 1440.5082 1455.7815 1467.8048 1475.3074 1478.9556 1479.3755 1485.0939 1507.9501 1515.8774 1586.7512 1599.6793 1623.2077 1629.2813 2957.8967 2966.0129 2984.7452 3007.4619 3025.6216 3041.8689 3081.3969 3093.0892 3099.0603 3103.9604 3119.2972 3122.5805 3131.8042 3147.8068 3156.2891 3174.5319 3185.9670
redmass: 2.3625 4.2710 3.1045 3.2895 3.6090 1.0852 3.9724 4.0168 3.3957 3.9608 1.1896 3.2020 2.6773 3.4208 3.9331 3.6327 4.3287 3.1827 3.2712 4.8320 6.5393 5.4988 3.2845 5.8906 4.2099 3.3797 6.3662 6.9643 1.3004 4.6432 5.2300 1.9441 1.3854 1.5708 3.3447 1.7645 2.1343 1.4030 2.8987 1.4197 1.6683 1.3564 2.0024 1.7441 3.3334 2.3932 1.8617 2.2123 1.6816 1.7735 2.2585 1.9795 1.4293 1.1177 1.4006 1.2212 2.0555 1.2906 1.8903 2.6976 1.9623 1.9641 1.5608 2.4564 1.2282 2.5064 1.8748 4.8795 1.3150 2.3500 2.2809 1.0639 1.0722 1.0469 1.0685 1.1164 1.1557 3.7616 7.0338 5.3413 7.3792 6.4225 1.0572 1.0385 1.0363 1.1026 1.0624 1.1012 1.0983 1.1039 1.0983 1.1005 1.0866 1.0866 1.0902 1.0957 1.0978 1.0942 1.0930
irintensity: 2.8725 0.5270 1.0353 0.3324 2.1945 0.0340 2.4068 0.4071 0.7334 7.4722 0.1724 0.7574 2.0095 0.6279 17.3377 4.6070 0.8884 11.5119 1.1973 4.4122 1.5127 2.5863 4.9616 6.7213 1.0306 0.2524 3.9903 3.2718 6.7951 1.0982 0.8609 72.4568 25.0886 28.8020 0.4840 6.9883 2.0619 0.4497 3.7269 1.6918 1.7168 0.5157 7.9383 8.1856 1.7920 7.7940 65.0507 15.3951 2.2166 2.4494 2.6583 5.4741 1.7897 0.3868 2.9381 0.9455 5.1312 1.6961 2.8046 75.8302 14.5200 22.7201 15.4910 13.6469 21.4838 22.6917 30.8851 9.1753 51.3563 5.8570 4.2614 10.2472 8.1170 18.9726 8.8136 4.3324 8.8185 12.0806 6.7419 15.6450 224.8235 1.3001 40.0594 121.2747 27.7878 30.9412 24.5801 33.4263 28.6585 24.8742 2.1128 12.4057 0.9259 4.9481 15.3764 30.1692 39.2132 9.5899 16.1490
temp: 298.150 k
press: 1.00000 atm
elementType: 8 7 6 6 6 6 6 6 6 6 6 6 6 6 6 6 6 6 1 1 1 1 1 1 1 1 1 1 1 1 1 1 1 1 1
symmnumber: 1
zpe: 759007.1 jmol-1
zpe.correction: 0.289091 hartree
zpe.thermalcorrener: 0.304070 hartree
zpe.thermalcorrenthalpy: 0.305015 hartree
zpe.thermalcorrgfe: 0.247745 hartree
zpe.sumelectzpe: -748.608977 hartree
zpe.sumelectthermal: -748.593997 hartree
zpe.sumelectthermalent: -748.593053 hartree
zpe.sumelectthermalfe: -748.650323 hartree
dipole: 0.4916 -3.1452 -2.3566
dipole: 3.9607
quadrupole: -93.3535 -99.8119 -110.9445
quadrupole: -8.4699 -6.4780 -4.1632
quadrupole: 8.0164 1.5581 -9.5745 -8.4699 -6.4780 -4.1632
hfenergy: -748.8980676 hartree
pointgroup: C01 [X(C16H17N1O1)]
dipole: -0.1291647 0.9960593 -1.1913675 debye
polarizability: 233.6457716|10.5675408|191.4895033|-0.6185118|-16.5249767|113.7893448 unknown
InChI: InChI=1S/C16H17NO/c1-16(10-11-17(2)15(16)18)14-9-5-7-12-6-3-4-8-13(12)14/h3-9H,10-11H2,1-2H3
charge 0 multiplicity 1
35 atoms
O  -2.859138 -1.0694 1.21853
N  -3.273327 0.163583 -0.729688
C  -1.125978 0.520064 0.290731
C  -1.249046 1.410296 -1.002958
C  -2.694803 1.229868 -1.555339
C  -2.483905 -0.24569 0.330288
C  0.096323 -0.434601 0.238734
C  -1.095989 1.356508 1.611521
C  1.442175 0.082907 0.037513
C  -0.068551 -1.817962 0.403442
C  -4.640636 -0.31396 -0.925879
C  2.560051 -0.848062 0.003086
C  1.034147 -2.725002 0.363336
C  1.75205 1.47887 -0.130733
C  2.327915 -2.252204 0.165699
C  3.894744 -0.357783 -0.191759
C  3.061443 1.927965 -0.316516
C  4.150347 1.003891 -0.34905
H  -0.511457 1.093887 -1.756919
H  -1.059375 2.473519 -0.778353
H  -3.297647 2.156181 -1.458498
H  -2.697757 0.942928 -2.624748
H  -1.920364 2.094031 1.624638
H  -1.22754 0.679096 2.472524
H  -0.140808 1.892551 1.732705
H  -1.066864 -2.218648 0.593892
H  -5.368815 0.516237 -0.841385
H  -4.852031 -1.059669 -0.141763
H  -4.756519 -0.785171 -1.920197
H  0.950607 2.219676 -0.111762
H  0.847618 -3.796308 0.4960
H  3.182052 -2.939228 0.135712
H  4.717362 -1.083058 -0.212827
H  3.256094 2.999595 -0.436997
H  5.173723 1.366196 -0.49498
