program: Gaussian 09
title: 000180148
version: EM64L-G09RevD.01
frameworkgroup: C1[X(C5H8N3O4PS)]
method: RPBEPBE
basis: SDD
operation: Freq
keyword: #p
keyword: freq=noraman
keyword: PBEPBE/SDD
title: #p freq=noraman PBEPBE/SDD
converged: YES YES NO NO
title: Mulliken charges:
elementType: S P O O O O N N N C C C C C H H H H H H H H
charge: -0.016323 1.092082 -0.642426 -0.680394 -0.647181 -0.231136 -0.444689 -0.670859 -0.003238 0.404297 -0.866757 0.315595 -0.361700 0.024965 0.307707 0.304680 0.235627 0.326866 0.421906 0.314835 0.414163 0.401983
chargesum: 0.00000
title: Mulliken charges with hydrogens summed into heavy atoms:
elementType: S P O O O O N N N C C C C C
charge: -0.016323 1.092082 -0.228263 -0.278412 -0.647181 -0.231136 -0.117823 0.065881 -0.003238 0.404297 -0.254371 0.315595 -0.126073 0.024965
polarizability: 2.29986660e+02 1.71866810e-01 1.29845316e+02 5.35733164e+00 8.23911821e-02 8.34573212e+01
1716.lowfreq: -10.2681 -2.9934 -0.0027 -0.0019 -0.0016 8.7541 22.7149 41.0757 50.0227
frequency: 22.5157 41.0267 50.0056 70.5984 116.4148 137.9018 141.9075 178.0397 192.3929 227.0990 274.7165 295.0028 312.3431 318.2290 329.3008 343.3516 367.5350 416.3528 438.8845 469.4571 473.0385 526.0895 547.5670 564.6629 684.0347 685.1350 714.4856 723.1181 746.1494 773.1027 785.3726 861.1280 899.2478 907.0961 943.4890 975.2772 1000.7038 1042.4916 1055.2520 1093.6535 1143.8996 1225.6939 1255.1529 1315.7613 1340.3055 1379.6081 1438.8375 1449.8768 1572.8002 1591.8289 1644.6407 1699.7426 3048.9762 3088.5931 3128.1264 3132.2750 3500.6382 3559.9227 3594.3154 3603.5042
redmass: 4.9719 3.2531 5.9303 9.5197 5.9235 8.9843 7.8451 3.7101 5.4287 2.3591 2.0611 6.2825 14.5568 2.9149 2.3754 3.3580 4.8345 3.2835 6.2535 1.4572 3.9577 4.7852 7.4629 4.4052 7.9085 2.7616 2.3858 9.8109 5.5933 5.6841 6.5823 1.8100 2.8304 1.1629 1.4743 3.0071 1.1985 4.5567 1.7289 1.6180 1.1966 1.1776 2.9278 2.0507 1.4805 2.5259 2.0627 1.6945 6.6647 4.1874 6.2645 1.1973 1.0598 1.0909 1.0998 1.0846 1.0774 1.0659 1.0829 1.0668
irintensity: 13.6492 82.0851 17.3506 2.1453 2.4898 3.2777 9.7048 21.2618 0.8089 31.7438 55.0761 38.7058 10.1253 4.0264 97.5199 18.0202 22.6202 99.2747 180.5428 52.5981 45.4715 66.2706 5.9888 4.3169 249.4141 42.2683 29.0155 170.9548 9.7872 52.6980 27.8278 18.0017 26.2314 213.2710 12.0072 74.2646 118.3932 37.4653 66.7907 9.0972 17.7971 120.7209 57.5309 8.3983 52.5538 15.9011 40.7191 36.7221 304.4025 180.3425 851.4282 140.9421 7.4083 15.2466 165.9005 522.3714 26.6115 111.7878 57.4095 78.3825
temp: 298.150 k
press: 1.00000 atm
elementType: 16 15 8 8 8 8 7 7 7 6 6 6 6 6 1 1 1 1 1 1 1 1
symmnumber: 1
zpe: 385548.5 jmol-1
zpe.correction: 0.146848 hartree
zpe.thermalcorrener: 0.162378 hartree
zpe.thermalcorrenthalpy: 0.163322 hartree
zpe.thermalcorrgfe: 0.102496 hartree
zpe.sumelectzpe: -1398.725967 hartree
zpe.sumelectthermal: -1398.710437 hartree
zpe.sumelectthermalent: -1398.709493 hartree
zpe.sumelectthermalfe: -1398.770318 hartree
dipole: -6.5713 -3.8014 -0.1223
dipole: 7.5926
quadrupole: -134.1066 -87.9754 -96.7294
quadrupole: -4.0246 -12.7250 -5.7990
quadrupole: -27.8361 18.2951 9.5410 -4.0246 -12.7250 -5.7990
hfenergy: -1398.8728147 hartree
pointgroup: C01 [X(C5H8N3O4P1S1)]
dipole: -2.579668 -1.5019574 0.1119311 debye
dipolederiv: -1.253729 0.0461443 -0.0329646 -0.152782 -0.3210596 0.0919629 0.4886493 -0.073704 -0.1929813 2.5648526 0.3182971 -0.1137266 0.7021657 1.4218828 -0.0698012 0.0080913 -0.0639008 1.5499778 -1.3927382 0.0391891 -0.2582361 0.0294189 -0.5423827 -0.1043593 -0.2656885 -0.0970217 -0.5016721 -0.7724594 -0.1620211 0.2838461 -0.2973954 -0.6369494 0.0652216 0.456022 0.1019308 -1.0116354 -1.0509711 0.0418311 0.0390994 -0.0618124 -0.8037909 -0.0738265 0.0431972 -0.0472055 -0.588472 -1.4022151 0.1184064 -0.3267616 0.4363119 -0.4824511 0.1587176 -0.514923 0.0707351 -0.5528108 -1.1341497 -0.0365508 -0.2349065 -0.2868645 -0.3679979 -0.0710321 -0.291185 0.0217089 -0.3379258 -0.8759226 -0.4477025 0.0369321 -0.3419556 -0.8841657 -0.1215246 0.0237862 -0.10103 -0.5486912 -1.2649296 -0.0541653 -0.2611591 0.7096002 -0.4903787 0.2746796 -0.6229928 0.0418178 -0.4382791 -1.0987954 0.0529006 -0.1024196 -0.3317047 -0.786582 -0.0318177 -0.4244711 0.2615513 -0.2579319 1.8154568 -0.3541318 0.0079423 -0.6480534 0.115957 -0.0299109 -0.3514365 0.0006667 0.1964841 0.9117201 0.2321163 0.1925496 0.1514839 1.3053057 -0.0650122 0.2266871 -0.2356618 0.3274086 1.3750168 0.2700355 0.3297872 0.4623709 0.4538365 -0.0528997 0.5267577 -0.0199119 0.1388567 1.9025124 -0.00599 0.546093 -0.5231666 0.7892567 -0.279444 0.7901685 -0.1349188 0.5444558 -0.0745309 0.0269311 -0.0263196 0.0230746 0.0375357 -0.0926126 0.0650932 -0.0311605 0.0640181 -0.0153638 -0.0231421 0.0629265 0.0955473 0.0218439 0.0772364 0.0824746 0.0200176 0.0512298 0.0766241 0.089916 -0.0431067 0.067682 -0.0497769 0.06769 -0.0211446 0.076678 0.0616263 0.1758721 -0.0601638 -0.0435017 -0.0713359 0.1084029 0.0369641 -0.0338363 0.035525 0.2879223 0.819907 -0.12788 -0.0291633 -0.0668143 0.203853 0.0397332 0.0964639 0.04954 0.2999383 0.1488652 0.0405718 -0.0586354 0.037065 0.2223408 0.0530287 -0.0790046 0.0435173 0.3161315 0.3521974 -0.0667117 0.0854888 -0.0476069 0.3226689 0.1012166 0.014344 0.0707134 0.267564 0.1927805 0.0621199 -0.0537641 0.114771 0.362651 0.0257899 -0.2170526 0.010113 0.3247862 unknown
polarizability: 228.4544179|3.4913555|127.521699|15.4505867|-9.9411359|87.3131802 unknown
InChI: InChI=1S/C5H8N3O4PS/c6-4-3(1-7-5(9)8-4)2-14-13(10,11)12/h1,8,10-11H,2,6H2
charge 0 multiplicity 1
22 atoms
S  -1.931197 1.52745 -0.035354
P  -3.258609 -0.268314 -0.108778
O  -4.6684 0.176921 -0.965762
O  -4.041343 -0.474205 1.422999
O  -2.495127 -1.564678 -0.655616
O  4.450227 -0.374414 1.122594
N  2.327531 -1.028056 0.438788
N  0.204682 -1.870228 -0.165545
N  3.04753 1.268841 0.142943
C  0.793622 0.497903 -0.576716
C  -0.464921 0.862523 -1.254016
C  1.075896 -0.821319 -0.107495
C  1.834187 1.464777 -0.398395
C  3.365096 -0.016311 0.595815
H  -0.949308 0.048121 -1.81505
H  -0.356345 1.747626 -1.898639
H  1.638478 2.489672 -0.747716
H  2.598175 -1.950859 0.794916
H  -0.793257 -1.756136 -0.447978
H  0.500627 -2.80054 0.129608
H  -5.511776 -0.155336 -0.558563
H  -3.48067 -0.796739 2.17296
