program: Gaussian 09
title: 000180145
version: EM64L-G09RevD.01
frameworkgroup: C1[X(C12H23NO2)]
method: RPBEPBE
basis: SDD
operation: Freq
keyword: #p
keyword: freq=noraman
keyword: PBEPBE/SDD
title: #p freq=noraman PBEPBE/SDD
converged: YES YES NO NO
title: Mulliken charges:
elementType: O O N C C C C C C C C C C C C H H H H H H H H H H H H H H H H H H H H H H H
charge: -0.301280 -0.308312 -0.026267 0.333296 0.345833 -0.147689 -0.261436 -0.281721 -0.692840 -0.708210 -0.712759 -0.697436 -0.709266 -0.716734 -0.166813 0.254071 0.196173 0.222289 0.201973 0.205394 0.244864 0.210191 0.208074 0.223421 0.235073 0.195632 0.222467 0.216158 0.226123 0.246039 0.214041 0.204880 0.223350 0.235347 0.197995 0.220529 0.219911 0.227641
chargesum: 0.00000
title: Mulliken charges with hydrogens summed into heavy atoms:
elementType: O O N C C C C C C C C C C C C
charge: -0.301280 -0.308312 -0.026267 0.333296 0.345833 0.106381 0.157026 0.125646 -0.029711 -0.054084 -0.048011 -0.032477 -0.052575 -0.048653 -0.166813
polarizability: 1.61855806e+02 -1.06172485e+00 1.35316988e+02 -4.14134248e-01 5.62552306e+00 1.27178309e+02
1716.lowfreq: -0.0004 0.0004 0.0006 1.4917 8.8839 15.0525 23.6944 30.5095 37.4552
frequency: 23.4979 30.3079 37.3321 39.2120 59.7472 111.9422 117.8747 144.0205 161.0607 173.6207 182.1557 216.9008 230.9691 236.1514 251.7060 252.8185 270.4874 281.6180 320.8170 324.4413 329.2497 340.7833 367.6982 417.6544 431.4572 434.6963 447.6965 474.1465 484.8797 573.9718 625.0496 723.6007 742.8348 789.7599 823.0224 853.2585 899.8627 900.5521 912.8677 915.7217 938.1597 942.4370 945.7829 953.2271 1008.9280 1013.4167 1018.2828 1024.9074 1029.8063 1041.1257 1093.3676 1124.3583 1181.8184 1186.1422 1194.6867 1214.9048 1242.4096 1247.8071 1248.6586 1266.5645 1270.4796 1328.4204 1351.5038 1362.7116 1368.9528 1372.1314 1377.0354 1379.0948 1397.2423 1398.4719 1447.4426 1447.9034 1460.9661 1461.3497 1465.6293 1466.1532 1470.3488 1472.8683 1476.3456 1476.8630 1482.2317 1487.0040 1494.8525 1495.5993 2197.8334 2942.6477 2954.9155 2979.6336 2979.9626 2984.2000 2985.1766 2992.5645 2992.8842 3002.5635 3007.9604 3053.6399 3072.3392 3073.4632 3079.0078 3079.5515 3083.5995 3084.2676 3092.4008 3093.1554 3095.9088 3096.1065 3099.6595 3100.3986
redmass: 3.1395 3.6206 4.4588 3.1487 3.8279 3.7129 2.1055 3.3541 1.2489 1.3558 3.0450 1.6520 1.0889 1.2657 1.1229 1.0907 3.1667 2.3148 2.6577 2.5494 2.5816 2.7004 2.5526 2.6218 2.6969 2.7805 2.9509 2.8208 2.8999 3.9871 4.4976 4.7147 4.1100 3.1411 3.1049 3.2548 1.6086 1.6095 1.6230 1.5879 2.0259 1.2794 1.2075 2.0227 2.6734 1.4943 1.4994 1.4642 1.8531 3.2579 2.0377 2.3609 1.8347 1.8289 1.4352 1.1433 1.7619 2.8097 2.5120 3.0975 2.6981 1.4880 1.2955 1.2720 1.2233 1.2211 1.2605 1.2773 1.2102 1.2100 1.0499 1.0494 1.0508 1.0507 1.0504 1.0502 1.0664 1.0641 1.0578 1.0580 1.0651 1.0685 1.0553 1.0570 12.5473 1.0582 1.0637 1.0351 1.0354 1.0358 1.0360 1.0355 1.0356 1.0826 1.1011 1.0977 1.0992 1.0993 1.0985 1.0985 1.1007 1.1006 1.1002 1.1003 1.0999 1.0998 1.0996 1.0996
irintensity: 1.0778 1.7270 1.9429 1.0453 0.8855 1.8881 4.7653 0.8377 0.3400 1.4993 0.3348 0.2680 0.0530 0.2208 0.3940 0.3980 2.8205 2.0936 0.1700 3.8641 1.9612 1.1639 1.6668 0.8083 2.2123 6.0024 1.2264 0.6233 0.9754 5.6285 5.0731 4.7885 11.9048 2.3128 5.3270 32.9367 0.3222 0.7370 2.5388 1.4213 17.5553 2.9902 0.1471 16.8377 118.8263 10.8918 11.0396 10.3128 40.8129 35.8273 16.7508 7.9612 165.4479 59.9367 20.0964 3.8299 14.3864 3.7510 39.5507 23.0139 15.3763 0.3205 5.7187 7.6834 38.4803 34.9205 45.0664 11.7600 24.3396 14.5645 0.8698 1.3730 0.5806 1.7656 1.8584 1.3289 1.7450 5.9538 11.1059 11.5525 0.3345 2.0906 34.7572 18.1850 8.4196 47.0224 55.8677 20.8279 21.4415 21.5473 20.9853 19.0015 11.3872 5.9233 45.0447 22.0761 3.5051 0.3080 72.2445 60.1880 14.1611 9.6999 13.4414 9.0542 49.6814 49.3816 43.7786 51.4380
temp: 298.150 k
press: 1.00000 atm
elementType: 8 8 7 6 6 6 6 6 6 6 6 6 6 6 6 1 1 1 1 1 1 1 1 1 1 1 1 1 1 1 1 1 1 1 1 1 1 1
symmnumber: 1
zpe: 862553.5 jmol-1
zpe.correction: 0.328529 hartree
zpe.thermalcorrener: 0.348122 hartree
zpe.thermalcorrenthalpy: 0.349066 hartree
zpe.thermalcorrgfe: 0.279654 hartree
zpe.sumelectzpe: -675.010406 hartree
zpe.sumelectthermal: -674.990813 hartree
zpe.sumelectthermalent: -674.989869 hartree
zpe.sumelectthermalfe: -675.059282 hartree
dipole: 1.6387 -4.0479 -1.9656
dipole: 4.7890
quadrupole: -79.7713 -104.9546 -92.2012
quadrupole: 3.1654 -4.1653 -5.3469
quadrupole: 12.5378 -12.6456 0.1078 3.1654 -4.1653 -5.3469
hfenergy: -675.3389355 hartree
pointgroup: C01 [X(C12H23N1O2)]
dipole: 0.5818481 1.5833682 0.8392629 debye
polarizability: 161.6419347|0.8260614|135.1439305|2.654942|5.824643|127.5652379 unknown
InChI: InChI=1S/C12H23NO2/c1-11(2,3)14-8-10(7-13)9-15-12(4,5)6/h10H,8-9H2,1-6H3
charge 0 multiplicity 1
38 atoms
O  -2.350887 -0.055772 0.554716
O  1.86245 0.43764 0.120838
N  -0.024087 -2.71374 -0.781192
C  -3.366094 0.612248 -0.325387
C  3.342726 0.675427 0.050115
C  -0.078609 -0.71163 0.985651
C  -0.980122 0.44538 0.489625
C  1.350311 -0.222582 1.317869
C  -3.059444 0.309059 -1.810349
C  -4.679736 -0.06164 0.110733
C  -3.400552 2.132522 -0.047809
C  4.086335 -0.674563 -0.074934
C  3.484794 1.50112 -1.241347
C  3.821289 1.480076 1.279871
C  -0.052696 -1.819313 0.007541
H  -0.535922 -1.09958 1.918694
H  -0.843451 1.314405 1.167549
H  -0.679334 0.742927 -0.530921
H  1.291482 0.488617 2.169896
H  1.979456 -1.084333 1.618695
H  -2.966489 -0.780096 -1.962709
H  -3.876237 0.687113 -2.45213
H  -2.122897 0.788174 -2.1489
H  -4.875167 0.135854 1.179121
H  -4.608778 -1.153848 -0.030627
H  -5.529454 0.318979 -0.483696
H  -2.453294 2.621339 -0.340316
H  -4.213816 2.607933 -0.625874
H  -3.579727 2.323288 1.025471
H  3.654694 -1.268437 -0.8991
H  5.156386 -0.500318 -0.289388
H  4.028148 -1.271263 0.853533
H  2.920983 2.44635 -1.155429
H  3.082039 0.935396 -2.099038
H  4.545725 1.736795 -1.438405
H  3.72588 0.8975 2.214366
H  4.886327 1.751487 1.164746
H  3.236466 2.411585 1.383214
