program: Gaussian 09
title: 000180133
version: EM64L-G09RevD.01
frameworkgroup: C1[X(C15H14N4O4)]
method: RPBEPBE
basis: SDD
operation: Freq
keyword: #p
keyword: freq=noraman
keyword: PBEPBE/SDD
title: #p freq=noraman PBEPBE/SDD
converged: YES YES NO NO
title: Mulliken charges:
elementType: O O O O N N N N C C C C C C C C C C C C C C C H H H H H H H H H H H H H H
charge: -0.330266 -0.260685 -0.211684 -0.210414 -0.363310 -0.099630 -0.116989 0.022080 0.375475 0.158515 0.175933 -0.378221 -0.295709 -0.262940 -0.330033 -0.346254 0.382576 -0.318355 -0.260401 -0.339309 -0.336739 -0.641907 0.282857 0.257419 0.311443 0.280807 0.256166 0.255284 0.224798 0.260948 0.285073 0.288572 0.286239 0.329634 0.208688 0.235900 0.224440
chargesum: 0.00000
title: Mulliken charges with hydrogens summed into heavy atoms:
elementType: O O O O N N N N C C C C C C C C C C C C C C C
charge: -0.330266 -0.260685 -0.211684 -0.210414 -0.033675 -0.099630 -0.116989 0.022080 0.375475 0.158515 0.175933 -0.120803 0.015734 0.017867 -0.073867 0.133828 0.382576 -0.057407 0.024672 -0.050738 -0.050500 0.027121 0.282857
polarizability: 6.24607237e+02 2.87371821e+00 1.95212989e+02 -7.77055237e+00 3.15169086e-01 8.96559182e+01
1716.lowfreq: -6.1079 -4.0570 -0.0013 0.0006 0.0013 2.4186 15.4241 17.4497 24.4139
frequency: 15.2249 17.4233 24.4094 34.7358 39.3969 43.4395 66.9368 77.4911 102.3260 119.8214 142.8326 168.0388 185.5011 208.1509 220.4048 265.4910 304.2207 315.5037 319.8349 345.1339 381.2032 401.2067 413.2005 423.7252 444.9634 488.5375 495.9693 531.6294 542.0865 573.4439 596.9772 611.6090 624.0890 664.2064 666.9917 680.8655 682.7304 730.8387 750.0650 752.6813 775.2569 799.5603 827.7114 837.8412 851.1290 867.0133 882.0312 884.9118 899.5363 936.8687 985.0335 990.7606 994.5562 995.1702 995.7362 1008.7699 1071.8642 1089.8527 1099.5516 1101.8163 1109.3497 1131.2276 1148.0764 1148.3135 1168.4208 1183.2344 1212.5317 1216.6165 1245.7351 1283.9750 1287.6011 1290.4071 1339.3679 1358.0574 1359.3097 1378.7290 1393.0369 1406.5424 1423.4740 1434.2650 1461.1382 1467.8249 1471.9443 1474.7434 1482.8541 1490.4237 1562.5968 1582.9273 1600.1174 1610.7727 1702.8700 2986.5788 3004.1301 3072.0923 3090.0591 3101.4016 3157.2667 3160.1812 3163.7850 3167.7543 3178.2036 3185.6308 3189.6903 3211.1202 3564.5224
redmass: 4.3353 4.6567 3.9696 7.0500 5.3684 5.6514 7.1160 5.6261 4.6993 4.5003 8.0305 8.8729 3.0978 9.6221 1.8371 3.1262 7.3866 3.4443 7.3530 5.8369 5.2934 4.1675 3.0213 3.4789 4.0077 8.9864 3.0767 5.8376 2.8300 7.1056 1.2006 6.3488 7.2206 7.3011 4.5601 7.6414 7.9058 4.1499 3.8576 4.4146 3.7557 2.0253 6.0286 1.2762 1.2444 1.5424 2.3619 1.6677 6.8400 3.4394 1.3270 1.3393 2.8133 1.3509 2.6803 1.3438 3.4339 3.3966 1.3807 1.7737 1.4158 2.1480 1.5112 1.7105 2.2682 1.7829 5.8764 2.8439 3.9644 1.3130 1.1672 1.3301 7.9594 1.2875 8.6389 6.2505 1.2157 9.6594 4.3015 4.3344 2.3214 1.1813 1.0707 1.8707 1.0729 1.8438 7.4026 7.7705 6.7503 6.5534 9.9901 1.0359 1.0657 1.0987 1.0980 1.1021 1.0884 1.0910 1.0896 1.0883 1.0970 1.0963 1.0966 1.0949 1.0772
irintensity: 0.3518 0.8226 0.0264 2.8025 0.7073 4.0181 0.0512 0.1006 1.3486 2.0726 0.2913 4.7118 3.3524 1.1911 1.5228 2.4724 2.5139 18.5845 0.2122 8.0940 0.6194 2.2671 0.0367 0.0689 8.8866 8.6335 0.0696 12.0866 17.6039 11.1318 129.3942 17.0386 3.7279 2.9561 29.9375 10.1955 19.1937 2.7412 35.9135 0.3140 17.5895 8.3677 13.5035 2.3386 0.8143 38.5387 88.6623 115.5568 0.1641 366.8688 0.0014 0.7034 0.9725 0.2023 23.7203 0.0189 186.4741 77.6589 2.7674 141.9379 80.4143 1089.1451 256.2726 61.2150 639.4997 158.6426 494.5709 221.1021 76.8794 18.1873 46.9955 0.0948 266.7482 0.9086 112.8653 20.4527 20.3276 6.6061 53.0388 20.1679 28.4768 207.9698 18.5487 211.9880 22.1377 235.7458 80.2714 33.6870 129.9473 146.7247 250.5904 30.0613 53.2301 8.8017 37.8968 35.6749 4.1085 2.8700 2.0719 1.4587 9.1170 0.1737 0.4374 4.1731 57.3217
temp: 298.150 k
press: 1.00000 atm
elementType: 8 8 8 8 7 7 7 7 6 6 6 6 6 6 6 6 6 6 6 6 6 6 6 1 1 1 1 1 1 1 1 1 1 1 1 1 1
symmnumber: 1
zpe: 717922.1 jmol-1
zpe.correction: 0.273442 hartree
zpe.thermalcorrener: 0.294589 hartree
zpe.thermalcorrenthalpy: 0.295533 hartree
zpe.thermalcorrgfe: 0.218462 hartree
zpe.sumelectzpe: -1098.148386 hartree
zpe.sumelectthermal: -1098.127239 hartree
zpe.sumelectthermalent: -1098.126295 hartree
zpe.sumelectthermalfe: -1098.203366 hartree
dipole: 10.6307 2.9342 -0.0834
dipole: 11.0285
quadrupole: -148.2599 -125.8857 -135.3247
quadrupole: 8.1080 1.3069 -0.3501
quadrupole: -11.7698 10.6043 1.1654 8.1080 1.3069 -0.3501
hfenergy: -1098.4218278 hartree
pointgroup: C01 [X(C15H14N4O4)]
dipole: -4.243515 -0.4751721 -0.7703218 debye
polarizability: 620.9579417|-42.2228187|150.736375|7.7639537|52.1432198|137.7818279 unknown
InChI: InChI=1S/C15H14N4O4/c1-2-16-15(20)23-14-9-5-12(6-10-14)18-17-11-3-7-13(8-4-11)19(21)22/h3-10,16H,2H2,1H3
charge 0 multiplicity 1
37 atoms
O  -4.563415 0.198051 -0.578074
O  -5.373775 1.869096 0.940364
O  8.112888 -1.141905 -0.49166
O  7.921863 0.542268 1.036909
N  -6.779657 0.582311 -0.436547
N  1.026705 0.399711 0.165408
N  1.753197 -0.44626 -0.528011
N  7.413842 -0.30493 0.202835
C  -3.179395 0.317304 -0.330416
C  -0.374529 0.308778 -0.05915
C  3.160263 -0.339242 -0.283605
C  -2.397724 -0.601461 -1.084473
C  -2.573376 1.238129 0.561434
C  -1.005258 -0.609403 -0.952865
C  -1.171489 1.219691 0.684779
C  -8.061627 1.141136 0.027713
C  5.942906 -0.317274 0.033058
C  3.970565 -1.242133 -1.024936
C  3.764797 0.581168 0.623419
C  5.367609 -1.237519 -0.872004
C  5.157764 0.59299 0.783199
C  -8.87911 0.138533 0.868212
C  -5.576083 0.986849 0.075678
H  -2.91111 -1.291676 -1.760505
H  -3.184158 1.935953 1.133944
H  -0.383174 -1.306744 -1.521006
H  -0.664851 1.913526 1.363295
H  -7.820488 2.03632 0.625028
H  -8.645185 1.471499 -0.852459
H  3.47649 -1.935104 -1.712609
H  3.12123 1.266109 1.182244
H  6.014441 -1.920098 -1.42848
H  5.654774 1.283453 1.46976
H  -6.769405 -0.170772 -1.12616
H  -9.126546 -0.770147 0.289064
H  -8.317673 -0.165444 1.768412
H  -9.828304 0.602734 1.191608
