program: Gaussian 09
title: 000016108
version: EM64L-G09RevD.01
frameworkgroup: C1[X(C10H19NO6)]
method: RPBEPBE
basis: SDD
operation: Freq
keyword: #p
keyword: freq=noraman
keyword: PBEPBE/SDD
title: #p freq=noraman PBEPBE/SDD
converged: YES YES NO NO
title: Mulliken charges:
elementType: O O O O O O N C C C C C C C C C C H H H H H H H H H H H H H H H H H H H
charge: -0.450858 -0.439281 -0.333950 -0.437696 -0.415306 -0.233515 -0.342765 0.353321 -0.234821 -0.431218 -0.820499 -0.730785 0.203363 -0.457608 -0.074222 -0.469308 0.210993 0.232826 0.250040 0.216062 0.252267 0.207139 0.228747 0.246263 0.258324 0.194881 0.215599 0.278026 0.320917 0.260272 0.374735 0.249617 0.221275 0.342971 0.372216 0.381978
chargesum: 0.00000
title: Mulliken charges with hydrogens summed into heavy atoms:
elementType: O O O O O O N C C C C C C C C C C
charge: -0.076123 -0.096310 -0.333950 -0.065480 -0.033327 -0.233515 -0.021848 0.353321 -0.001995 0.034883 -0.132347 -0.031318 0.203363 0.036017 0.186050 0.001585 0.210993
polarizability: 1.57802419e+02 3.94425911e+00 1.24717613e+02 -2.45200990e+00 -3.32716854e+00 1.20980964e+02
1716.lowfreq: -12.4115 -5.4990 0.0010 0.0011 0.0015 6.6343 21.2235 25.6273 37.3243
frequency: 20.7451 25.3249 37.1845 50.6995 52.9101 86.8817 98.1265 124.7747 156.0997 168.2088 180.6956 216.2660 227.9689 242.5766 260.2356 276.0687 294.9185 314.3717 326.0625 340.5366 360.9958 370.8526 395.7231 404.8906 435.5698 446.3573 505.2447 520.8523 569.4810 576.0249 594.4653 634.5500 671.5106 674.4268 713.5756 744.1442 759.1909 810.1727 853.8803 874.4420 891.4326 906.1911 922.1683 944.7644 950.1504 970.8809 983.4398 995.0955 1009.0945 1038.8017 1066.2682 1091.3203 1104.1227 1110.1047 1182.4480 1185.3326 1193.7931 1228.3871 1239.3820 1253.5405 1264.0167 1272.0871 1289.8079 1310.7340 1326.7615 1339.3846 1347.2214 1360.5212 1365.7095 1370.0842 1379.9838 1392.3356 1425.7382 1440.0181 1445.6283 1465.9100 1466.9329 1471.2412 1492.0791 1494.8670 1512.1161 1593.3665 1669.8058 2960.2402 2966.3877 2980.7536 2983.6524 2990.8128 3003.3004 3034.2247 3046.9453 3073.3426 3073.5507 3076.9080 3092.6476 3093.7914 3102.8168 3284.4758 3419.5255 3509.6343 3545.1221 3576.7913
redmass: 5.0378 6.3787 5.2478 5.6476 4.7748 4.3945 3.8841 3.8242 6.4561 5.5791 4.7894 4.4809 3.9236 1.0350 1.4641 2.5658 1.7911 1.2593 3.2086 2.9452 3.9998 2.6743 2.9807 2.8781 3.7375 2.7264 1.1895 2.8668 2.7503 1.3246 2.4522 4.1441 2.2059 2.4416 1.2371 3.2793 3.9355 3.7349 2.9817 2.3980 3.7976 1.7797 2.1754 1.3849 3.1255 2.0618 4.8886 2.5109 1.9349 2.4999 2.7622 2.7051 2.7074 1.4087 2.0220 1.2558 2.1639 1.3180 1.2674 1.8624 1.7756 1.4093 1.4841 1.6183 1.5161 1.2126 1.3568 1.4142 1.2061 1.1969 1.2807 1.2088 1.1193 1.1878 1.1154 1.0489 1.0728 1.0560 1.0649 1.0730 1.8390 5.0959 8.6342 1.0388 1.0656 1.0498 1.0714 1.0642 1.0610 1.0858 1.0983 1.0974 1.1023 1.0976 1.0962 1.0958 1.1002 1.0669 1.0646 1.0638 1.0780 1.0665
irintensity: 0.8327 1.1959 4.4365 1.5062 0.8688 0.2055 4.2773 1.1435 2.2347 6.8402 1.8382 1.8992 2.6038 13.6585 46.0243 2.5014 10.6134 55.0324 9.7874 8.2769 47.6022 1.7739 1.7201 1.8970 14.8948 21.5407 103.4595 63.9700 25.1342 79.2272 28.8854 27.6753 78.6521 48.1428 124.7709 8.9921 15.2073 8.8361 9.4260 19.5137 1.3551 13.2214 8.6505 13.9302 7.9693 19.8782 50.9655 84.5444 19.3369 61.5629 126.6574 113.3255 69.7560 13.8230 4.1213 18.1142 16.3420 5.1571 24.0027 26.1506 48.5981 24.8543 37.4627 12.7727 13.7101 16.3599 64.6814 38.6275 8.9055 11.0089 104.7756 24.1442 38.0928 49.1173 34.5903 2.1362 1.7197 8.6839 17.4896 14.3760 122.2307 95.8614 240.0983 22.3637 62.1575 9.7875 47.2305 13.0185 22.1296 22.0728 34.4843 27.7436 12.0725 23.5167 17.7922 20.3793 10.4589 312.4430 48.7693 23.4473 22.0597 8.1336
temp: 298.150 k
press: 1.00000 atm
elementType: 8 8 8 8 8 8 7 6 6 6 6 6 6 6 6 6 6 1 1 1 1 1 1 1 1 1 1 1 1 1 1 1 1 1 1 1
symmnumber: 1
zpe: 771561.4 jmol-1
zpe.correction: 0.293872 hartree
zpe.thermalcorrener: 0.313585 hartree
zpe.thermalcorrenthalpy: 0.314529 hartree
zpe.thermalcorrgfe: 0.244165 hartree
zpe.sumelectzpe: -897.185407 hartree
zpe.sumelectthermal: -897.165695 hartree
zpe.sumelectthermalent: -897.164751 hartree
zpe.sumelectthermalfe: -897.235115 hartree
dipole: 0.8461 -0.1516 5.6669
dipole: 5.7317
quadrupole: -130.4087 -101.5289 -98.5735
quadrupole: -7.7664 3.4471 -6.9808
quadrupole: -20.2383 8.6415 11.5969 -7.7664 3.4471 -6.9808
hfenergy: -897.4792793 hartree
pointgroup: C01 [X(C10H19N1O6)]
dipole: -0.0797005 -0.0981566 2.2514691 debye
polarizability: 156.6271101|7.7602925|125.5924732|-1.6000853|2.9573972|121.2814128 unknown
InChI: InChI=1S/C10H19NO6/c1-10(2,5-12)8(16)9(17)11-4-6(13)3-7(14)15/h6,8,11-14,16H,3-5H2,1-2H3
charge 0 multiplicity 1
36 atoms
O  -3.11287 1.122771 -0.816595
O  -2.019085 -3.060225 -0.534385
O  -0.495148 1.398884 -1.227507
O  2.216251 1.638217 -1.414655
O  3.195197 -2.01069 -1.169813
O  4.740102 -0.535877 -0.256369
N  0.012855 1.451326 1.040853
C  -2.392235 -0.828814 0.56613
C  -2.26825 0.721649 0.303755
C  -1.982034 -1.60191 -0.723635
C  -1.509817 -1.269698 1.761545
C  -3.878518 -1.125932 0.889741
C  -0.833875 1.211133 -0.002974
C  1.364319 2.05703 0.903749
C  2.372813 1.301595 -0.008095
C  2.337748 -0.233234 0.219004
C  3.552177 -0.894486 -0.402979
H  -2.652911 1.245578 1.202535
H  -2.717406 -1.402363 -1.518881
H  -0.98113 -1.278868 -1.080109
H  -1.769577 -2.303117 2.051168
H  -1.696558 -0.637948 2.652813
H  -0.427626 -1.239452 1.53111
H  -4.04573 -2.217286 0.880648
H  -4.535754 -0.659081 0.13686
H  -4.157405 -0.734694 1.88685
H  1.776136 2.128635 1.925975
H  1.266243 3.08212 0.49795
H  -0.337503 1.272845 1.983883
H  3.382506 1.667335 0.254759
H  -2.5011 1.278302 -1.592299
H  1.420426 -0.673554 -0.203108
H  2.365905 -0.4520 1.305866
H  -1.197027 -3.35006 -0.066226
H  1.236901 1.572778 -1.636191
H  4.015378 -2.40911 -1.571474
