program: Gaussian 09
title: 000180108
version: EM64L-G09RevD.01
frameworkgroup: C1[X(C12H2Br4Cl2O2)]
method: RPBEPBE
basis: SDD
operation: Freq
keyword: #p
keyword: freq=noraman
keyword: PBEPBE/SDD
title: #p freq=noraman PBEPBE/SDD
converged: NO NO NO YES
title: Mulliken charges:
elementType: Br Br Br Br Cl Cl O O C C C C C C C C C C C C H H
charge: 0.111588 0.111588 0.087964 0.087964 0.053986 0.053985 -0.257362 -0.257362 0.435858 0.435858 0.279808 0.279808 -0.373849 -0.373849 -0.343873 -0.343873 -0.081741 -0.081741 -0.205144 -0.205145 0.292765 0.292765
chargesum: 0.00000
title: Mulliken charges with hydrogens summed into heavy atoms:
elementType: Br Br Br Br Cl Cl O O C C C C C C C C C C C C
charge: 0.111588 0.111588 0.087964 0.087964 0.053986 0.053985 -0.257362 -0.257362 0.435858 0.435858 0.279808 0.279808 -0.373849 -0.373849 -0.051108 -0.051108 -0.081741 -0.081741 -0.205144 -0.205145
polarizability: 3.77433263e+02 -1.69276098e+01 2.70870652e+02 8.48599052e-03 -8.27589930e-03 7.04321882e+01
1716.lowfreq: -3.3711 -3.0705 -0.0016 -0.0015 -0.0009 2.9333 18.1292 31.0408 58.7341
frequency: 18.1292 31.0408 58.7335 62.3759 65.9732 101.6871 110.2082 133.1616 137.0472 156.3770 156.9061 184.7125 185.8252 195.1373 242.6295 250.0416 265.7484 288.8039 294.5906 353.9919 357.3365 397.4462 405.5759 494.4352 518.0618 518.9225 519.3684 562.0647 581.1435 596.3862 613.2542 637.2652 694.4362 707.9510 708.8541 757.9295 785.7964 858.3147 862.9114 862.9597 901.6417 927.1271 1100.8264 1110.6528 1147.8550 1148.9838 1218.8990 1272.5208 1325.1036 1339.0792 1357.1235 1358.5842 1419.7171 1425.4056 1544.9895 1561.4159 1574.6339 1611.4922 3187.7097 3187.7670
redmass: 39.5768 18.8987 40.1735 32.7050 38.7957 73.9722 8.7984 40.4392 35.2191 10.5158 14.0324 36.7848 39.9311 44.6353 36.2059 7.0405 24.6312 7.8994 14.7100 12.0710 12.6309 12.8925 18.3681 9.0512 4.4698 4.6134 8.8785 8.5810 12.0051 12.1590 12.2189 11.9484 8.2797 7.6756 10.1500 8.9460 9.9568 8.2705 1.3951 1.4081 12.6215 12.1075 6.5745 8.9845 2.0041 2.1112 3.7238 3.9710 10.3987 9.9267 10.8279 6.7553 4.8880 6.0749 11.0474 8.4681 11.1557 9.4045 1.0931 1.0931
irintensity: 0.0074 0.0174 0.0000 0.1599 0.0227 0.0000 0.0000 0.0000 0.5540 0.3167 0.0000 0.0105 0.0000 0.0000 0.3496 2.8274 0.0000 0.0000 1.5340 0.0000 5.2653 0.0000 10.9680 14.6764 2.1115 0.0000 0.0000 0.0000 0.0106 0.0000 0.0000 0.0000 11.6070 0.0000 63.2541 74.6738 0.0000 39.6655 51.0511 0.0031 249.0294 0.0001 4.0630 0.0000 0.0000 107.2987 0.0000 185.9943 0.0000 53.9256 267.1143 0.0000 1168.8479 0.0000 110.7082 0.0000 0.0000 33.6746 6.3917 0.0000
temp: 298.150 k
press: 1.00000 atm
elementType: 35 35 35 35 17 17 8 8 6 6 6 6 6 6 6 6 6 6 6 6 1 1
symmnumber: 1
zpe: 271881.6 jmol-1
zpe.correction: 0.103554 hartree
zpe.thermalcorrener: 0.122664 hartree
zpe.thermalcorrenthalpy: 0.123608 hartree
zpe.thermalcorrgfe: 0.051302 hartree
zpe.sumelectzpe: -1581.449305 hartree
zpe.sumelectthermal: -1581.430196 hartree
zpe.sumelectthermalent: -1581.429251 hartree
zpe.sumelectthermalfe: -1581.501558 hartree
dipole: 0.0000 0.0000 -0.0001
dipole: 0.0001
quadrupole: -173.7419 -157.8179 -166.4101
quadrupole: -5.5893 0.0002 -0.0004
quadrupole: -7.7520 8.1721 -0.4201 -5.5893 0.0002 -0.0004
hfenergy: -1581.5528594 hartree
pointgroup: C01 [X(C12H2Br4Cl2O2)]
dipole: -0.0000006 0.0000018 0.000022 debye
dipolederiv: 0.0640324 0.0087967 -0.000014 0.0801008 -0.5092855 0.0000341 0.0000443 -0.0001492 0.0548433 0.063406 0.0084162 -0.0000303 0.0801142 -0.5092209 0.0000402 0.0000553 -0.0000729 0.0548463 -0.4228731 -0.2921352 0.0000672 -0.3823056 -0.2348236 0.0000224 -0.0004048 -0.000774 0.0289109 -0.4234446 -0.2926256 0.0000077 -0.3822003 -0.2349152 -0.0000178 -0.0000203 -0.0000267 0.0289515 -0.6425584 0.2270073 0.0000211 0.2912484 -0.098106 -0.0000078 0.0000804 0.000043 0.0045177 -0.6416784 0.2277035 0.0000035 0.2907965 -0.0984044 0.0000016 -0.0000048 0.0000397 0.004517 -2.330096 -0.0054511 0.000024 -0.1853532 -0.30442 0.0000199 0.0002601 0.0002138 -0.1296288 -2.3299785 -0.0050227 0.000044 -0.1854757 -0.304571 -0.000018 -0.0000888 -0.0001881 -0.1296457 1.2286428 0.1198428 -0.000023 1.2284604 -0.207978 -0.0000331 -0.0004515 -0.0004809 0.1328291 1.2288304 0.119633 0.0000115 1.2282524 -0.2080244 -0.0000014 -0.0000724 -0.0001161 0.1328447 1.5064421 -0.0887007 0.0000271 -0.8903258 0.2401172 0.0000155 0.0004127 0.0002918 0.0716763 1.5063551 -0.0888367 -0.0000317 -0.8899741 0.2404133 0.0000419 0.0001628 0.0002667 0.0716739 -0.307946 -0.0246802 -0.0000042 -0.0988526 0.967044 -0.0000449 -0.0001558 0.0001858 -0.1307469 -0.3067855 -0.0239273 0.0000376 -0.0985956 0.9668752 -0.0000559 -0.0001812 0.0000658 -0.130751 -0.4999178 -0.1183846 0.0000021 -0.1868417 -0.1425484 0.0000285 -0.0003267 -0.000274 -0.0885691 -0.5000999 -0.1186529 0.0000049 -0.1867557 -0.1422048 0.0000621 0.000011 -0.0001283 -0.0885619 0.6705751 -0.4648431 0.0000026 -0.5872284 -0.205787 0.000036 0.0001045 -0.0001049 0.0012215 0.6688446 -0.4661245 -0.0000029 -0.5866037 -0.204907 0.000028 -0.0000962 -0.0002155 0.0012162 0.6304917 0.6049641 -0.0001269 0.708183 0.4472807 -0.0000828 0.0002667 0.0008416 -0.1226767 0.6309492 0.6053739 -0.0000282 0.7081355 0.4470312 -0.0000241 0.0003086 0.0004527 -0.1227012 0.1034176 0.0338482 0.000001 0.0225345 0.0483227 -0.0000186 0.0000603 0.0000306 0.1776155 0.1033913 0.0337986 0.000007 0.0226867 0.0481119 -0.0000256 0.0000361 0.0000992 0.1776173 unknown
polarizability: 376.7036094|19.0726351|271.6003061|-0.0083165|-0.0084462|70.4321882 unknown
InChI: InChI=1S/C12H2Br4Cl2O2/c13-3-1-5-11(7(15)9(3)17)20-6-2-4(14)10(18)8(16)12(6)19-5/h1-2H
charge 0 multiplicity 1
22 atoms
Br -2.656392 3.126251 -0.000121
Br 2.656383 -3.126252 0.000119
Br -5.093868 -2.218528 0.000257
Br 5.093859 2.218527 0.000002
Cl -5.330193 1.122568 0.000098
Cl 5.330185 -1.122568 0.000133
O  -0.127138 1.449743 -0.000207
O  0.127129 -1.449743 -0.000082
C  -1.258774 0.604738 -0.000118
C  1.258765 -0.604738 -0.00007
C  1.136463 0.804318 -0.000131
C  -1.136472 -0.804318 -0.000055
C  -2.538729 1.194616 -0.000083
C  2.53872 -1.194616 0.000003
C  2.269297 1.625282 -0.000111
C  -2.269306 -1.625282 0.000045
C  -3.697682 0.372021 0.000011
C  3.697673 -0.372021 0.000016
C  -3.550677 -1.03594 0.000078
C  3.550668 1.03594 -0.00004
H  2.142506 2.709917 -0.000145
H  -2.142515 -2.709917 0.000102
