program: Gaussian 09
title: 000180107
version: EM64L-G09RevD.01
frameworkgroup: C1[X(C12H4Br2Cl2O2)]
method: RPBEPBE
basis: SDD
operation: Freq
keyword: #p
keyword: freq=noraman
keyword: PBEPBE/SDD
title: #p freq=noraman PBEPBE/SDD
converged: NO YES NO NO
title: Mulliken charges:
elementType: Br Br Cl Cl O O C C C C C C C C C C C C H H H H
charge: 0.103666 0.072370 0.000124 0.006343 -0.260610 -0.252227 0.434723 0.254092 0.465371 0.415679 -0.368726 -0.371392 -0.459619 -0.346575 -0.110392 -0.209425 -0.197523 -0.245564 0.275005 0.269485 0.258641 0.266554
chargesum: 0.00000
title: Mulliken charges with hydrogens summed into heavy atoms:
elementType: Br Br Cl Cl O O C C C C C C C C C C C C
charge: 0.103666 0.072370 0.000124 0.006343 -0.260610 -0.252227 0.434723 0.254092 0.465371 0.415679 -0.368726 -0.096387 -0.459619 -0.346575 -0.110392 0.060060 0.061118 0.020990
polarizability: 2.73679237e+02 -6.99161041e+00 2.43242369e+02 5.50793296e-03 4.73316921e-03 6.44897232e+01
1716.lowfreq: -4.9761 -0.0021 -0.0013 -0.0005 3.1705 5.7216 30.8926 34.7786 68.9308
frequency: 30.8823 34.7764 68.9302 81.8285 94.8408 129.7074 148.7149 163.6084 170.2103 245.8094 249.8434 273.8972 286.5862 288.2185 323.5925 332.1608 395.6059 422.6201 470.1874 513.0168 516.3810 548.9082 549.4656 559.7873 560.3180 577.2911 669.9361 687.1931 698.7846 705.0365 788.2193 802.3039 803.6632 858.1150 887.5368 905.9549 930.0154 930.4090 1091.3611 1105.6562 1123.6937 1131.5374 1172.2339 1198.7718 1213.5830 1262.1793 1357.4468 1371.2120 1393.3637 1411.1885 1434.8686 1439.3057 1562.4840 1567.4138 1590.7251 1614.1115 3170.3786 3171.7269 3188.7685 3189.2791
redmass: 17.9947 12.4047 50.4386 10.2882 8.7517 34.3012 18.8875 13.9733 37.5787 7.1091 30.6464 6.6188 7.1993 17.2618 7.5909 12.1358 8.4432 7.0390 9.0170 4.6999 4.5171 5.6469 7.9969 6.3278 10.4700 12.0546 8.7636 7.8612 7.8846 8.1793 1.3254 8.9239 1.3447 9.1758 8.6753 9.6921 1.3198 1.3254 3.6003 6.4033 1.9958 2.2322 1.8082 1.9274 2.2493 3.0858 10.3090 6.9715 4.9583 7.6455 3.4764 2.9634 8.1143 8.8377 8.8926 9.8097 1.0886 1.0889 1.0977 1.0976
irintensity: 0.6114 0.1093 0.1056 0.4189 2.4026 0.2206 0.1382 0.0718 0.1194 1.1037 0.0398 1.4711 0.4869 0.6785 0.4224 0.5830 1.3388 10.4630 10.7321 0.8548 0.9078 6.6513 1.5030 15.9770 3.6024 2.7605 4.5742 0.0669 6.6664 1.1809 44.1076 5.7884 51.6833 118.3027 13.9217 213.0863 0.0700 0.4085 4.4677 49.4967 8.1829 13.6379 12.7085 1.7208 1.1889 246.7876 17.7436 19.9219 82.5988 424.1366 360.4696 97.0589 31.9812 0.0656 5.0691 1.8566 0.1697 0.5789 0.3628 0.0868
temp: 298.150 k
press: 1.00000 atm
elementType: 35 35 17 17 8 8 6 6 6 6 6 6 6 6 6 6 6 6 1 1 1 1
symmnumber: 1
zpe: 325776.9 jmol-1
zpe.correction: 0.124082 hartree
zpe.thermalcorrener: 0.139986 hartree
zpe.thermalcorrenthalpy: 0.140930 hartree
zpe.thermalcorrgfe: 0.077691 hartree
zpe.sumelectzpe: -1555.886839 hartree
zpe.sumelectthermal: -1555.870934 hartree
zpe.sumelectthermalent: -1555.869990 hartree
zpe.sumelectthermalfe: -1555.933230 hartree
dipole: -1.6808 1.2620 -0.0002
dipole: 2.1019
quadrupole: -126.5698 -128.6234 -137.7019
quadrupole: 8.8788 0.0010 0.0003
quadrupole: 4.3953 2.3416 -6.7369 8.8788 0.0010 0.0003
hfenergy: -1556.0109205 hartree
pointgroup: C01 [X(C12H4Br2Cl2O2)]
dipole: 0.6008096 0.5682051 0.0000819 debye
dipolederiv: 0.0511885 -0.0680797 0.0000007 -0.1609831 -0.4456817 0.0000039 0.0000016 0.0000082 0.0483313 0.0117186 -0.0889277 0.0000014 -0.0134308 -0.5512927 0.0000146 0.0000011 0.0000196 0.0221383 -0.1142141 -0.1355353 -0.000001 -0.2310451 -0.6958838 0.0000097 0.0000009 0.0000093 -0.0222395 -0.7824606 -0.1125782 -0.000005 -0.172472 -0.0754309 -0.0000006 0.0000008 0.0000008 -0.0283312 -1.9764886 0.2159844 -0.0000673 0.3200904 -0.2523993 0.0000004 -0.0000729 -0.0000189 -0.1215891 -1.9932527 0.1884738 -0.0000626 0.3045696 -0.4029086 0.0000311 -0.000066 0.0000479 -0.1261406 1.0010361 -0.2451726 0.0000003 -1.1685238 -0.0099948 -0.0000157 0.0000082 0.0000115 0.1344735 1.3766202 -0.0315795 0.0000013 0.7302866 0.0713838 0.0000158 -0.0000241 -0.0000094 0.0636518 1.3518186 -0.1754751 0.0000824 0.7351987 -0.2595597 0.0000444 0.0000718 0.0000074 0.1256523 0.9367045 -0.2165368 0.0000642 -1.1828494 0.0792702 -0.0000575 0.0001012 -0.0000188 0.1111805 -0.365391 0.2085519 -0.0000093 0.2191672 0.8643053 -0.0000045 -0.0000037 -0.0000142 -0.1346459 -0.1628185 -0.0077106 -0.0000064 0.0400164 0.0168453 -0.0000036 0.0000006 0.0000008 -0.1537124 -0.1871547 0.2085056 0.0000009 0.0210084 1.0467331 -0.0000314 -0.000001 -0.000035 -0.1670441 -0.017279 0.2355683 0.0000038 0.4008467 1.0517995 -0.0000218 -0.0000072 -0.0000201 -0.1011049 1.0784625 0.0527058 0.0000077 0.3475836 -0.1079277 0.000001 -0.0000045 0.0000008 -0.0370651 -0.2494345 0.0411401 -0.0000053 -0.1291627 -0.0238742 0.0000004 -0.0000106 0.000001 -0.1045562 -0.0250808 -0.006448 0.0000064 -0.0277675 -0.2519959 -0.0000008 0.0000135 0.0000052 -0.0905794 -0.0624212 -0.0806798 0.0000088 -0.0628172 -0.2026275 0.0000042 0.0000137 -0.0000035 -0.104629 0.0833495 -0.0496493 0.0000021 -0.0332362 0.014871 0.0000011 0.0000027 -0.0000018 0.1806232 0.0176833 0.0530946 0. 0.0461824 0.0422465 0.0000006 0.0000001 0.0000001 0.1703043 0.0279624 0.0531442 -0.0000114 0.061612 0.0289713 0.0000092 -0.0000136 0.0000098 0.1640381 -0.0005484 -0.0387962 -0.0000116 -0.0442742 0.0631507 -0.0000006 -0.0000127 -0.0000007 0.1712442 unknown
polarizability: 271.7160151|10.2363424|245.2055911|0.0060084|-0.0040791|64.4897232 unknown
InChI: InChI=1S/C12H4Br2Cl2O2/c13-5-1-2-7(16)11-10(5)18-12-8(17-11)4-3-6(15)9(12)14/h1-4H
charge 0 multiplicity 1
22 atoms
Br -2.752862 -2.618193 -0.000006
Br 1.962235 -3.49406 0.000187
Cl 3.156297 2.960379 0.000063
Cl -5.229849 -0.313195 -0.00004
O  -0.069581 -1.185598 -0.000094
O  0.463262 1.671594 -0.000141
C  -1.116691 -0.234058 -0.000066
C  -0.859875 1.157506 -0.00009
C  1.24995 -0.673731 0.000021
C  1.508038 0.720876 -0.000003
C  -2.446139 -0.707937 -0.000037
C  -1.912373 2.082606 -0.000083
C  2.323418 -1.584856 0.000138
C  2.836762 1.182063 0.000094
C  -3.505315 0.232842 -0.000045
C  -3.244235 1.617743 -0.000066
C  3.654976 -1.11476 0.000227
C  3.912571 0.271797 0.000205
H  -1.683312 3.151027 -0.000091
H  -4.077933 2.324136 -0.000065
H  4.483096 -1.827408 0.000315
H  4.939858 0.644826 0.000274
