program: Gaussian 09
title: 000016115
version: EM64L-G09RevD.01
frameworkgroup: C1[X(C15H15ClN2O2)]
method: RPBEPBE
basis: SDD
operation: Freq
keyword: #p
keyword: freq=noraman
keyword: PBEPBE/SDD
title: #p freq=noraman PBEPBE/SDD
converged: YES YES NO NO
title: Mulliken charges:
elementType: Cl O O N N C C C C C C C C C C C C C C C H H H H H H H H H H H H H H H
charge: -0.065852 -0.304519 -0.317347 -0.503905 -0.164312 0.485550 0.324373 -0.432116 -0.321584 -0.372443 -0.357063 0.302961 0.343054 -0.630834 -0.670164 -0.336913 -0.368596 -0.191301 -0.179768 -0.118754 0.216734 0.315111 0.321400 0.255890 0.263701 0.225101 0.225164 0.290208 0.236500 0.235578 0.250189 0.272279 0.261093 0.254413 0.256172
chargesum: 0.00000
title: Mulliken charges with hydrogens summed into heavy atoms:
elementType: Cl O O N N C C C C C C C C C C C C C C C
charge: -0.065852 -0.304519 -0.317347 -0.182505 -0.164312 0.485550 0.324373 -0.215382 -0.006473 -0.116553 -0.093361 0.302961 0.343054 0.109638 0.052102 -0.064634 -0.107503 0.063112 0.076404 -0.118754
polarizability: 3.40022878e+02 4.81095771e+00 1.69579518e+02 1.69147491e+01 1.52927781e+00 1.16443743e+02
1716.lowfreq: -11.7373 -3.1262 -0.0018 -0.0013 -0.0012 3.7134 17.7808 25.5033 32.3745
frequency: 17.5045 25.2858 32.1515 41.1091 70.3856 84.6004 94.5334 123.7814 131.1520 147.4050 176.7014 189.2484 232.7515 251.6116 264.2457 304.6192 334.1814 350.0054 373.2898 389.2048 412.7252 416.7404 420.7872 451.9481 488.9758 508.1280 560.1909 583.9244 603.1956 616.2642 628.8785 648.9838 692.5768 701.9638 715.3170 747.5038 811.2712 816.0741 823.6744 825.2110 849.1219 858.2141 860.5192 934.1103 939.5244 954.0911 985.9854 992.1850 998.9016 1006.3801 1060.5261 1068.4599 1095.1824 1103.8556 1113.8307 1136.2505 1151.0771 1162.0575 1169.7380 1186.6117 1215.5401 1253.1710 1270.5755 1284.2667 1299.6981 1339.3245 1364.2755 1375.5404 1401.3021 1415.4479 1420.3191 1448.3780 1465.5888 1480.8451 1482.1617 1494.8397 1495.3677 1497.0317 1512.4084 1585.4512 1593.7146 1601.4664 1622.8347 1626.9801 2938.8258 2966.6297 3006.6243 3040.6274 3099.0383 3113.1700 3118.2922 3152.0797 3157.7421 3160.2788 3170.1625 3175.6711 3180.3708 3194.2620 3549.4161
redmass: 4.6951 5.7469 4.0162 3.6474 3.8809 1.9923 6.3334 2.1485 5.2946 2.6255 1.3739 7.3385 2.5635 5.6903 5.6040 6.5617 6.1264 4.7243 5.1115 4.3467 3.0550 3.0787 4.5859 4.3687 2.9590 2.5383 1.3256 5.2215 5.3637 6.7890 6.5828 6.7049 3.8252 10.6078 4.2855 5.5404 1.2683 1.4237 1.6591 3.9325 5.4223 1.7037 4.5877 1.3551 1.3243 1.3456 1.3055 3.9737 3.0854 2.3495 1.4154 2.6322 1.2329 1.2954 1.3062 1.3288 2.1328 2.2291 1.1865 1.4093 3.8038 4.7895 2.0496 1.2631 1.5514 3.1670 5.0674 5.7700 3.8587 4.1031 1.1624 1.1851 2.3413 1.0998 1.0515 1.0573 1.7806 1.5551 1.9573 7.2387 6.6197 6.9916 4.5318 5.7067 1.0384 1.0366 1.1018 1.1024 1.0941 1.0900 1.0964 1.0909 1.0883 1.0886 1.0948 1.0969 1.0978 1.0947 1.0753
irintensity: 2.6361 0.5665 1.1379 0.2842 2.2521 5.7958 1.4864 0.9248 3.4464 0.1375 0.0575 1.2924 4.7061 6.3613 0.0674 6.0957 0.8133 1.6585 11.4579 17.1594 0.7273 0.3800 1.9704 1.8004 27.7914 64.4026 35.8497 10.3993 0.4697 21.6340 0.4374 3.0113 5.6845 21.7208 0.3680 15.0576 1.1117 46.9811 63.1921 19.0382 10.8861 40.4823 34.8398 0.1114 0.2202 0.5036 2.6470 60.6474 33.7776 18.7679 22.9083 58.1776 0.0278 12.3780 20.6562 0.2325 37.6248 265.2655 18.3096 9.9410 628.6858 13.2354 10.8120 0.9771 11.1376 34.3009 86.4779 143.2431 1.8272 50.8673 31.5348 30.0645 418.2402 76.0413 35.2539 25.1392 425.7903 18.7053 400.3004 6.8571 31.3740 21.8832 100.8758 166.6942 55.0665 109.0786 39.6274 43.5961 19.3806 27.7446 0.8194 8.1756 3.3925 2.8140 4.3151 3.8467 1.3222 12.0460 13.7674
temp: 298.150 k
press: 1.00000 atm
elementType: 17 8 8 7 7 6 6 6 6 6 6 6 6 6 6 6 6 6 6 6 1 1 1 1 1 1 1 1 1 1 1 1 1 1 1
symmnumber: 1
zpe: 707617.7 jmol-1
zpe.correction: 0.269517 hartree
zpe.thermalcorrener: 0.288770 hartree
zpe.thermalcorrenthalpy: 0.289714 hartree
zpe.thermalcorrgfe: 0.218719 hartree
zpe.sumelectzpe: -1299.170118 hartree
zpe.sumelectthermal: -1299.150866 hartree
zpe.sumelectthermalent: -1299.149921 hartree
zpe.sumelectthermalfe: -1299.220916 hartree
dipole: 6.4265 2.6120 2.3690
dipole: 7.3304
quadrupole: -97.5354 -124.5531 -124.3843
quadrupole: 3.5116 15.7501 -0.2171
quadrupole: 17.9556 -9.0622 -8.8934 3.5116 15.7501 -0.2171
hfenergy: -1299.4396353 hartree
pointgroup: C01 [X(C15H15Cl1N2O2)]
dipole: -2.4999377 1.1988653 -0.7940779 debye
polarizability: 339.7607835|-11.9726416|169.9301002|13.987427|3.5314672|116.3552555 unknown
InChI: InChI=1S/C15H15ClN2O2/c1-18(2)15(19)17-12-5-9-14(10-6-12)20-13-7-3-11(16)4-8-13/h3-10,17H,1-2H3
charge 0 multiplicity 1
35 atoms
Cl 6.82716 -1.960585 -0.720919
O  2.050215 1.499361 0.54596
O  -3.723831 -1.788043 0.691219
N  -3.451284 0.367822 -0.224908
N  -5.573392 -0.66696 -0.210628
C  -2.058875 0.567183 -0.019423
C  0.697309 1.120238 0.311244
C  -1.508137 1.80458 -0.455182
C  -1.206601 -0.391116 0.595872
C  -0.13718 2.081617 -0.294271
C  0.163885 -0.107005 0.762429
C  -4.215423 -0.762274 0.122617
C  3.108732 0.61695 0.236358
C  -6.454669 -1.79593 0.128937
C  -6.165748 0.502766 -0.87494
C  3.007791 -0.43021 -0.710906
C  4.335664 0.886579 0.886404
C  4.145293 -1.216132 -1.001675
C  5.471951 0.103856 0.594503
C  5.359687 -0.940458 -0.34531
H  -2.15475 2.556715 -0.925733
H  -1.632533 -1.334414 0.941272
H  -3.93224 1.148941 -0.671878
H  0.291586 3.032082 -0.62462
H  0.811658 -0.839769 1.254788
H  -6.916849 -2.225829 -0.780443
H  -7.256798 -1.477763 0.822316
H  -5.843646 -2.568796 0.619014
H  -6.093015 1.421946 -0.257058
H  -5.711242 0.69666 -1.868445
H  -7.237067 0.31139 -1.043475
H  2.062601 -0.630025 -1.22347
H  4.385636 1.705574 1.609449
H  4.081811 -2.026589 -1.733437
H  6.425201 0.302338 1.09244
