program: Gaussian 09
title: 000180095
version: EM64L-G09RevD.01
frameworkgroup: C1[X(C14H16N)]
method: RPBEPBE
basis: SDD
operation: Freq
keyword: #p
keyword: freq=noraman
keyword: PBEPBE/SDD
title: #p freq=noraman PBEPBE/SDD
converged: NO NO NO NO
title: Mulliken charges:
elementType: N C C C C C C C C C C C C C C H H H H H H H H H H H H H H H H
charge: -0.054975 0.101110 0.280855 0.304810 0.305104 -0.288129 -0.288149 -0.410892 -0.410719 -0.829043 -0.828993 -0.210988 -0.145851 -0.145856 -0.584797 0.293535 0.293531 0.253973 0.253940 0.234700 0.234725 0.260999 0.234641 0.234608 0.261017 0.250337 0.287631 0.287630 0.267276 0.267278 0.290691
chargesum: 1.00000
title: Mulliken charges with hydrogens summed into heavy atoms:
elementType: N C C C C C C C C C C C C C C
charge: -0.054975 0.101110 0.280855 0.304810 0.305104 0.005406 0.005382 -0.156919 -0.156780 -0.098619 -0.098725 0.039348 0.141780 0.141774 0.240448
polarizability: 2.15533890e+02 -7.13346346e-01 1.32476308e+02 -1.11920363e-03 -1.06008050e-02 1.07539678e+02
1716.lowfreq: -50.4227 -19.3513 -6.5472 -0.0007 -0.0004 -0.0001 4.5539 18.4672 54.7252
frequency: -49.5409 -19.1299 54.7252 67.1052 110.1324 111.8477 154.0082 161.3447 220.8197 222.2065 315.1563 322.6187 328.9581 391.7755 393.9117 428.0966 504.7671 510.6458 523.4145 548.3249 563.2954 625.2996 656.6156 738.8442 740.8378 748.8169 789.2049 803.9088 852.1676 861.0610 910.7863 917.4638 982.3422 984.3486 993.6003 996.6248 1004.0183 1041.2903 1042.6309 1043.1298 1045.1609 1054.2169 1106.4263 1123.3583 1149.7107 1185.2177 1186.4205 1221.1677 1254.3656 1261.6561 1287.0749 1305.1943 1349.5386 1360.3863 1406.1773 1407.2072 1422.1529 1438.9119 1448.6735 1449.6011 1470.5140 1475.6368 1476.3213 1476.6344 1477.1504 1479.4723 1505.6536 1538.1929 1581.5818 1602.2916 1628.2187 2969.5334 2970.1901 3023.8304 3041.3220 3041.4710 3092.4269 3092.7495 3127.4355 3137.6834 3145.1394 3146.1267 3169.4394 3180.0217 3181.2247 3198.7095 3203.9897
redmass: 3.8084 1.0223 3.6905 3.6379 1.1552 1.0566 2.4345 3.7405 3.9687 2.7208 3.7376 3.3764 3.2352 2.7263 2.8930 2.8979 3.0653 4.6469 5.3573 3.7588 3.0452 4.7408 6.2097 3.7615 3.6538 5.3457 1.2272 5.4788 1.5096 1.2718 1.3099 2.4707 1.3391 1.5007 1.3706 1.3514 6.3666 1.8359 1.5637 1.5114 2.7263 1.5674 1.6863 1.3645 1.2817 4.9030 1.1760 1.1795 4.8109 1.6054 2.4681 1.6762 8.1024 2.5238 1.2324 1.2176 1.8982 1.3218 2.4329 1.8509 1.2051 1.0826 1.2552 1.0563 1.0461 1.2280 2.1755 4.5971 7.2458 5.7022 5.2212 1.0396 1.0396 1.0347 1.0973 1.0973 1.0966 1.0964 1.1027 1.0871 1.0923 1.1039 1.0995 1.0906 1.0922 1.0980 1.1010
irintensity: 0.0029 0.1904 1.5322 0.5162 2.1192 0.0682 0.7951 0.0450 2.4319 0.0000 1.3183 7.7486 2.3938 0.1025 2.4907 4.6375 0.0000 5.7380 0.3890 2.7149 14.4422 1.1381 0.1042 1.9025 0.3353 0.4644 55.1114 2.7573 56.6052 0.0002 0.0000 0.2102 0.0054 4.6314 0.0025 0.0007 14.4384 1.0530 11.3050 0.0295 2.3633 1.2036 2.4018 7.1831 6.5527 34.3109 2.2853 3.3067 0.8766 0.4047 2.9453 0.3334 0.0498 1.0069 20.1812 5.8365 0.6804 19.6480 11.8204 2.5969 12.5831 41.2117 36.0205 57.9817 0.1384 11.5568 35.2039 21.8584 9.2910 16.9365 143.7863 21.2700 29.6412 2.6668 6.1348 26.2035 10.2001 23.4250 2.0973 0.1894 8.9624 1.2414 11.2125 0.1462 0.5506 3.5257 0.0259
temp: 298.150 k
press: 1.00000 atm
elementType: 7 6 6 6 6 6 6 6 6 6 6 6 6 6 6 1 1 1 1 1 1 1 1 1 1 1 1 1 1 1 1
symmnumber: 1
zpe: 685231.3 jmol-1
zpe.correction: 0.260991 hartree
zpe.thermalcorrener: 0.273880 hartree
zpe.thermalcorrenthalpy: 0.274824 hartree
zpe.thermalcorrgfe: 0.221589 hartree
zpe.sumelectzpe: -596.542221 hartree
zpe.sumelectthermal: -596.529332 hartree
zpe.sumelectthermalent: -596.528388 hartree
zpe.sumelectthermalfe: -596.581622 hartree
dipole: -9.4836 0.0473 -0.0001
dipole: 9.4837
quadrupole: -25.6840 -78.4802 -77.8553
quadrupole: -0.2276 -0.0006 -0.0044
quadrupole: 34.9892 -17.8070 -17.1821 -0.2276 -0.0006 -0.0044
hfenergy: -596.8032116 hartree
pointgroup: C01 [X(C14H16N1)]
dipole: 3.7311196 0.0185839 0.0000496 debye
polarizability: 215.5338972|0.7129127|132.4763001|-0.0011191|0.0106008|107.5396777 unknown
InChI: InChI=1S/C14H16N/c1-11-5-4-6-12(2)14(11)13-7-9-15(3)10-8-13/h4-10H,1-3H3
charge 1 multiplicity 1
31 atoms
N  3.310889 -0.015268 -0.000025
C  -1.017194 -0.00063 -0.000045
C  0.477533 -0.002756 -0.000044
C  -1.71709 -1.247169 -0.000022
C  -1.713045 1.248179 -0.000023
C  1.224387 -0.005567 -1.213274
C  1.224374 -0.004693 1.213194
C  -3.132388 -1.219618 0.000019
C  -3.128412 1.225228 -0.000004
C  -0.976309 -2.574678 0.00005
C  -0.968049 2.573338 -0.000038
C  -3.83538 0.003958 0.000025
C  2.623123 -0.011636 -1.19343
C  2.62311 -0.010786 1.193368
C  4.802422 0.017526 -0.000029
H  0.709037 -0.005924 -2.176962
H  0.709017 -0.00438 2.176878
H  -3.683129 -2.166511 0.000046
H  -3.676071 2.173914 -0.00002
H  -0.329574 -2.692666 -0.891017
H  -0.330185 -2.692862 0.891538
H  -1.68552 -3.418549 -0.000282
H  -0.32154 2.689515 0.891443
H  -0.321037 2.689233 -0.891187
H  -1.674629 3.41942 -0.000364
H  -4.930109 0.005754 0.000044
H  3.223958 -0.012746 -2.105238
H  3.223935 -0.011265 2.105184
H  5.185512 -0.496623 0.893735
H  5.185524 -0.49733 -0.893383
H  5.154944 1.062192 -0.000439
