program: Gaussian 09
title: 000180098
version: EM64L-G09RevD.01
frameworkgroup: C1[X(C22H22N4O6)]
method: RPBEPBE
basis: SDD
operation: Freq
keyword: #p
keyword: freq=noraman
keyword: PBEPBE/SDD
title: #p freq=noraman PBEPBE/SDD
converged: YES YES NO NO
title: Mulliken charges:
elementType: O O O O O O N N N N C C C C C C C C C C C C C C C C C C C C C C H H H H H H H H H H H H H H H H H H H H H H
charge: -0.451870 -0.305561 -0.290304 -0.450760 -0.191299 -0.263161 -0.151202 -0.158889 -0.420305 0.008440 -0.185269 0.163387 -0.489293 0.179148 0.142913 -0.583769 0.421106 -0.627527 -0.621838 -0.023127 0.606565 -0.407407 0.285575 0.255467 -0.574903 -0.453950 -0.377005 -0.406201 -0.196061 0.269232 -0.185050 -0.384541 0.246395 0.232187 0.256542 0.205541 0.252099 0.234946 0.286448 0.233109 0.259479 0.276670 0.232118 0.385793 0.347284 0.322974 0.242081 0.245940 0.246229 0.280533 0.241958 0.220012 0.248148 0.370973
chargesum: 0.00000
title: Mulliken charges with hydrogens summed into heavy atoms:
elementType: O O O O O O N N N N C C C C C C C C C C C C C C C C C C C C C C
charge: -0.066077 -0.305561 -0.290304 -0.079788 -0.191299 -0.263161 -0.151202 -0.158889 -0.097331 0.008440 0.061125 0.163387 -0.000564 0.179148 0.142913 -0.126129 0.421106 0.126976 0.146430 -0.023127 0.606565 -0.060123 0.285575 0.255467 -0.332822 -0.208010 -0.130775 -0.125667 0.045897 0.269232 0.034962 -0.136393
polarizability: 3.94631487e+02 9.02881235e+00 3.31960046e+02 -5.69335691e+00 2.58590068e+01 1.63168825e+02
1716.lowfreq: -9.9300 -1.7584 -0.0005 -0.0003 -0.0002 1.9314 23.0201 24.5819 38.3629
frequency: 22.6669 24.5655 38.3407 48.8874 59.8900 71.4220 74.5948 79.1007 85.3121 92.3472 97.1856 115.3294 116.4122 134.1413 146.2316 160.8710 188.5707 212.4304 214.3865 226.5528 232.8018 238.7615 254.9094 286.4539 310.9228 314.9012 332.4125 356.3825 363.4179 372.6295 380.3180 397.0533 406.3614 433.2570 435.5757 439.7572 454.2740 489.4860 495.2344 500.1865 514.7250 523.7624 542.3848 565.5171 568.6560 587.2041 592.7819 604.1326 613.0274 628.3273 645.9926 665.6775 691.4149 693.4334 698.3491 712.0827 724.4789 735.0662 735.2112 742.0968 785.8808 798.7432 801.8541 832.7093 842.9389 858.4468 883.7842 890.2971 909.6756 920.2199 936.5063 941.5034 959.0851 963.1315 971.1505 975.6123 986.4189 1001.5055 1007.5400 1039.3252 1044.7945 1049.1445 1074.1788 1078.3220 1086.7666 1120.4474 1122.8237 1127.1695 1133.5399 1155.7743 1169.2094 1173.8629 1185.6437 1194.1651 1205.2146 1210.1035 1217.8758 1226.5690 1232.5303 1255.7669 1269.2726 1285.9455 1292.1626 1294.6796 1299.9640 1314.0354 1331.1233 1345.6667 1346.2711 1364.0625 1381.9965 1388.0134 1400.3463 1412.3183 1420.2557 1425.1699 1435.1736 1442.4670 1454.0579 1457.1193 1460.5421 1472.0811 1475.6876 1479.7157 1484.7157 1488.0474 1502.1848 1533.4166 1560.1084 1583.7988 1610.2643 1616.0686 1620.7804 1629.1099 2983.3220 2990.0748 3002.3681 3005.7285 3018.6884 3065.5758 3066.0262 3094.1671 3100.4071 3125.6954 3129.5890 3142.8268 3145.1410 3151.1605 3164.8104 3167.0711 3167.8998 3172.0636 3188.6814 3311.1569 3375.5691 3609.0394
redmass: 6.4195 5.5881 6.8141 5.4526 8.6004 7.2732 6.4092 4.4680 4.1641 4.5337 1.2250 2.3282 1.3983 4.1001 6.1308 6.5486 4.7716 7.0199 3.4880 5.0430 4.6994 5.6991 3.8730 3.1760 3.2517 3.3900 4.0635 4.5016 5.8654 6.9731 6.5367 6.1485 5.8131 5.4294 4.6469 2.9333 5.0453 4.3958 5.1792 5.3107 2.8905 1.5450 4.6734 3.0586 1.4682 5.4410 3.9630 5.6386 4.9080 3.7609 4.5708 1.1691 3.1338 3.9352 3.5312 5.7021 4.5088 7.6407 3.1437 4.6399 2.7187 1.7781 1.8758 5.1006 2.2786 2.2915 2.3183 1.4436 1.4153 1.3917 2.5728 3.5854 3.9986 4.4211 1.3559 1.3803 6.0784 3.6608 3.3016 3.2909 3.1872 3.8184 1.6807 2.0101 2.0410 1.4764 1.3416 1.8507 2.0755 1.5844 1.1302 1.7534 1.4731 1.5184 2.1347 2.3228 2.4446 2.1649 1.6871 1.8756 1.5919 1.8936 1.5021 1.5097 2.0324 2.0457 2.4862 2.4398 2.3169 1.9004 4.8749 1.8774 4.8030 1.4556 1.2767 1.9015 2.1490 2.4959 1.2301 1.2208 2.6948 1.0732 4.2927 1.1902 1.0982 1.1122 2.4897 4.7663 6.4426 6.4284 6.2773 5.7909 6.2460 6.8400 1.0355 1.0417 1.0793 1.0597 1.0703 1.1020 1.1015 1.0904 1.0939 1.0988 1.0866 1.0895 1.1031 1.0938 1.0900 1.1020 1.0942 1.0970 1.0964 1.0641 1.0678 1.0813
irintensity: 0.7014 1.2633 0.0682 1.1176 0.6717 0.3458 4.0841 0.8234 2.4745 3.3634 1.2884 0.3236 0.4070 0.4969 3.6053 1.8624 1.4280 3.9371 2.0480 0.1327 6.3865 3.8567 2.2088 2.9650 1.0249 2.4599 3.5271 0.4332 0.0900 7.7951 10.5157 57.4161 7.4503 2.2528 4.5857 6.0887 7.0801 16.3883 14.5062 10.0469 32.1709 58.5615 2.9174 35.0875 60.4085 7.5122 18.3057 6.6703 13.3968 7.4782 19.6498 93.4565 31.9196 3.9740 74.8596 5.2359 0.9642 4.1811 27.3919 14.1581 30.4897 2.3586 49.6069 14.5028 30.4866 17.1617 3.4953 3.5658 19.0792 1.2441 1.2402 10.0402 2.6246 16.2042 1.3317 2.3254 4.1325 19.2248 52.8976 35.8560 133.2768 3.0135 51.7525 10.9357 16.2571 5.8344 3.3344 34.9743 25.4039 119.4322 13.6492 44.9909 30.8174 124.8302 47.0858 77.8714 84.7119 217.5882 11.4487 18.3625 13.6862 5.3687 13.2629 34.3477 106.1106 1.9880 78.4376 40.1682 53.6631 19.7654 192.5361 107.3510 16.6546 77.3351 51.7538 16.7136 42.9165 55.5755 4.8138 24.0072 24.6222 12.4391 10.0963 10.5986 16.6802 7.7808 4.9665 62.6398 30.8369 254.5569 32.8598 16.7375 306.3138 3.3753 36.3512 30.5408 2.9199 26.7089 24.8805 13.0924 23.5094 14.7849 5.3090 0.6050 11.0037 4.6336 0.1244 15.4983 5.3810 106.1461 2.3602 13.1592 5.4076 80.8399 695.8896 94.6509
temp: 298.150 k
press: 1.00000 atm
elementType: 8 8 8 8 8 8 7 7 7 7 6 6 6 6 6 6 6 6 6 6 6 6 6 6 6 6 6 6 6 6 6 6 1 1 1 1 1 1 1 1 1 1 1 1 1 1 1 1 1 1 1 1 1 1
symmnumber: 1
zpe: 1088078.8 jmol-1
zpe.correction: 0.414427 hartree
zpe.thermalcorrener: 0.443149 hartree
zpe.thermalcorrenthalpy: 0.444093 hartree
zpe.thermalcorrgfe: 0.354633 hartree
zpe.sumelectzpe: -1519.535419 hartree
zpe.sumelectthermal: -1519.506697 hartree
zpe.sumelectthermalent: -1519.505753 hartree
zpe.sumelectthermalfe: -1519.595213 hartree
dipole: -7.1865 -6.2804 0.3017
dipole: 9.5488
quadrupole: -154.1693 -202.4020 -185.8662
quadrupole: 13.4257 -2.4586 0.3880
quadrupole: 26.6432 -21.5895 -5.0537 13.4257 -2.4586 0.3880
hfenergy: -1519.9498464 hartree
pointgroup: C01 [X(C22H22N4O6)]
dipole: 3.43441 -1.5200004 -0.0889844 debye
polarizability: 393.9740939|8.9502199|325.0755892|-7.2248497|-43.7282654|170.7106747 unknown
InChI: InChI=1S/C22H22N4O6/c1-24-18(10-14-12-23-16-7-4-8-17(19(14)16)26(31)32)20(28)25(2)22(30,21(24)29)11-13-5-3-6-15(27)9-13/h3-9,12,18,23,27,30H,10-11H2,1-2H3
charge 0 multiplicity 1
54 atoms
O  -3.747344 -2.864842 0.562004
O  0.899612 -3.589489 0.851031
O  -3.35843 -1.634122 -1.704186
O  -1.824236 3.682329 -0.069257
O  1.923381 4.043982 -0.93304
O  0.837066 2.393195 0.185164
N  -1.043362 -1.500997 -1.436728
N  -1.380189 -3.105122 0.863609
N  4.426296 -1.232807 0.257214
N  1.914998 2.881576 -0.37215
C  0.160456 -1.797366 -0.624076
C  -2.485331 -2.159732 0.504296
C  0.7780 -0.479926 -0.031603
C  -0.090328 -2.902057 0.427316
C  -2.311986 -1.718124 -0.98119
C  -2.535226 -0.977308 1.545117
C  2.289823 -0.440532 0.045693
C  -0.829081 -1.048217 -2.824412
C  -1.647371 -4.132294 1.891874
C  3.20585 0.684145 -0.082662
C  -3.107461 0.332245 1.023876
C  3.081219 -1.578523 0.266787
C  4.550363 0.138134 0.033506
C  3.15613 2.102099 -0.317078
C  -2.217481 1.399459 0.756845
C  -4.493592 0.514391 0.794007
C  5.731138 0.890654 -0.088925
C  4.339286 2.866631 -0.467085
C  5.613496 2.271848 -0.352068
C  -2.687517 2.626872 0.229892
C  -4.961221 1.751453 0.290143
C  -4.072499 2.808731 0.000026
H  0.904881 -2.236439 -1.316943
H  0.351472 -0.29237 0.970084
H  0.419436 0.346392 -0.661531
H  -1.514771 -0.804895 1.931208
H  -3.144008 -1.371467 2.379585
H  -0.21092 -0.13281 -2.841169
H  -1.810013 -0.831445 -3.273011
H  -0.324382 -1.835231 -3.415373
H  -0.874142 -4.910709 1.809343
H  -2.64943 -4.548553 1.71593
H  -1.601798 -3.700317 2.909675
H  -4.200767 -2.672315 -0.315691
H  2.727016 -2.596333 0.445294
H  5.201244 -1.881346 0.379341
H  -1.150672 1.289559 0.972011
H  -5.195467 -0.299003 1.005984
H  6.714669 0.419406 0.013589
H  4.238668 3.938559 -0.654067
H  6.509334 2.890963 -0.453841
H  -6.033648 1.8943 0.115095
H  -4.42504 3.765042 -0.397868
H  -0.867224 3.408223 0.030717
