program: Gaussian 09
title: 000180093
version: EM64L-G09RevD.01
frameworkgroup: C1[X(C14H18O)]
method: RPBEPBE
basis: SDD
operation: Freq
keyword: #pfreq=noraman
keyword: PBEPBE/SDD
title: #p freq=noraman PBEPBE/SDD
converged: YES YES NO NO
title: Mulliken charges:
elementType: O C C C C C C C C C C C C C C H H H H H H H H H H H H H H H H H H
charge: -0.299385 -0.057490 -0.074172 -0.459323 -0.375466 -0.536160 -0.380127 -0.371211 -0.456438 0.096271 -0.033757 -0.110557 -0.596024 0.151654 -0.456727 0.235002 0.240160 0.217944 0.212314 0.200772 0.209950 0.255433 0.247595 0.212108 0.189086 0.190659 0.216047 0.196204 0.207326 0.211822 0.213903 0.218386 0.284199
chargesum: 0.00000
title: Mulliken charges with hydrogens summed into heavy atoms:
elementType: O C C C C C C C C C C C C C C
charge: -0.299385 0.177512 0.165989 -0.029065 0.035256 -0.033132 0.021068 0.035495 -0.052908 0.096271 0.178065 -0.110557 -0.163735 0.151654 -0.172528
polarizability: 1.70508093e+02 -4.94208883e+01 1.87267190e+02 -1.16719141e+01 9.86543150e+00 1.04522030e+02
1716.lowfreq: -3.7227 -0.0011 -0.0009 -0.0007 4.9026 6.4513 11.2576 30.8340 34.2637
frequency: 6.6729 30.6523 34.2055 47.3362 62.4646 76.5038 104.9675 118.2451 137.1941 146.5777 155.0548 199.5896 236.0609 285.6208 301.6193 318.4837 342.2884 385.3780 400.5457 432.4194 473.6243 497.7625 502.0758 520.5897 620.6789 626.2899 637.7892 698.0429 727.5412 746.6810 763.2552 792.6514 857.0467 876.1603 908.9453 927.7209 940.2437 941.5408 997.2959 1007.0917 1019.3193 1041.3466 1049.6907 1064.4309 1079.1654 1093.3338 1109.6435 1129.7085 1169.5528 1175.6713 1187.1133 1213.3017 1232.5868 1245.2249 1254.6326 1279.5474 1288.7686 1294.3190 1294.6940 1300.4554 1321.8123 1334.9645 1344.9533 1359.1051 1424.4531 1439.1142 1452.5110 1458.8720 1463.7759 1469.3861 1469.9880 1484.5243 1658.2483 2080.2004 2282.7848 2951.3047 2956.8529 2965.9015 2972.6319 2979.7476 2985.6135 2999.1996 3013.8310 3029.6696 3030.2689 3043.6939 3050.1977 3070.0976 3084.7392 3089.4155 3094.6332 3192.9564 3430.3883
redmass: 5.6281 3.1648 4.4595 2.4004 3.2623 3.6852 3.2523 2.1404 3.5150 2.3867 3.1643 3.2098 4.8336 2.1205 2.7079 3.9515 4.3239 4.3022 3.9255 2.1672 3.4369 10.1233 4.7144 4.2867 1.2088 1.2133 1.5371 3.5689 1.3356 2.0645 2.4412 1.7013 1.9022 2.0975 1.9193 1.6812 1.7643 1.4056 1.2841 1.4280 2.7564 2.0461 1.5430 2.0487 1.5136 2.2960 2.3277 1.7210 3.6651 1.3849 1.4571 1.3799 1.3320 1.3133 1.2954 1.1736 1.2837 1.3178 1.1724 1.2599 1.2295 1.4085 1.4101 1.5423 1.1796 1.9708 1.2729 1.1053 1.0857 1.1036 1.0963 1.1027 4.7457 6.8487 10.6632 1.0625 1.0592 1.0613 1.0602 1.0587 1.0636 1.0940 1.0964 1.1008 1.0997 1.1012 1.1027 1.0798 1.0929 1.0738 1.0886 1.1145 1.1515
irintensity: 0.0123 0.2326 0.3321 0.0341 0.2456 0.9144 1.1977 0.0023 2.9854 0.1161 7.8360 2.5900 3.7775 0.1538 0.0406 0.8171 7.3212 1.0092 8.3540 1.2389 0.8135 0.6550 4.3707 6.6175 72.1748 69.0707 15.1153 1.9685 10.5112 2.6507 22.4259 11.8198 21.0276 13.6913 11.1557 19.2323 5.7075 70.8475 7.9354 14.5434 4.0769 4.3805 1.1209 3.3955 4.0152 4.4685 3.9454 0.3388 1.9151 1.6655 10.4994 5.0929 1.0548 1.1328 0.3955 0.9417 1.5490 1.7832 0.8562 0.1542 8.2592 2.7996 1.0578 1.3190 3.8131 7.0166 13.3674 5.8778 4.3310 0.9550 12.1630 18.4225 18.7361 3.5216 25.4336 17.3321 8.3265 9.9270 85.0839 13.6645 25.6352 3.2467 7.9222 7.7955 5.2275 25.2848 114.2868 49.4555 7.0748 6.8277 44.2013 33.3570 105.9887
temp: 298.150 k
press: 1.00000 atm
elementType: 8 6 6 6 6 6 6 6 6 6 6 6 6 6 6 1 1 1 1 1 1 1 1 1 1 1 1 1 1 1 1 1 1
symmnumber: 1
zpe: 720111.5 jmol-1
zpe.correction: 0.274276 hartree
zpe.thermalcorrener: 0.291881 hartree
zpe.thermalcorrenthalpy: 0.292825 hartree
zpe.thermalcorrgfe: 0.224812 hartree
zpe.sumelectzpe: -618.191232 hartree
zpe.sumelectthermal: -618.173627 hartree
zpe.sumelectthermalent: -618.172683 hartree
zpe.sumelectthermalfe: -618.240696 hartree
dipole: -1.2696 0.0191 0.5603
dipole: 1.3879
quadrupole: -98.3760 -89.5593 -90.0843
quadrupole: 4.1481 -0.8388 -1.0391
quadrupole: -5.7028 3.1139 2.5889 4.1481 -0.8388 -1.0391
hfenergy: -618.4655078 hartree
pointgroup: C01 [X(C14H18O1)]
dipole: -0.4977379 -0.0561736 0.2173651 debye
polarizability: 182.5173795|-49.7852159|175.0162994|-13.4107214|9.5730278|104.7636336 unknown
InChI: InChI=1S/C14H18O/c1-3-5-7-8-10-12-14-13(15-14)11-9-6-4-2/h2-3,13-14H,1,5,7-8,10-12H2
charge 0 multiplicity 1
33 atoms
O  3.750239 -1.576963 -0.458704
C  2.227873 -1.498326 -0.38201
C  3.066141 -0.373073 0.137321
C  1.544974 -2.483393 0.548143
C  0.153366 -1.990392 1.026232
C  3.244154 0.92906 -0.648766
C  -0.885651 -1.815042 -0.106469
C  -2.289224 -1.451796 0.428078
C  -3.334135 -1.258614 -0.703426
C  2.231385 1.931147 -0.287744
C  -4.724915 -0.977384 -0.17422
C  1.360143 2.752607 0.036402
C  -5.465013 0.125878 -0.450735
C  0.395843 3.664904 0.38887
C  -0.475443 4.487865 0.7063
H  1.775469 -1.360281 -1.374556
H  3.192439 -0.286783 1.225673
H  2.205242 -2.652266 1.420118
H  1.438601 -3.458056 0.032051
H  -0.240133 -2.720574 1.761832
H  0.268437 -1.030078 1.56876
H  4.260076 1.331114 -0.463599
H  3.188925 0.699711 -1.731038
H  -0.553761 -1.022239 -0.807131
H  -0.94878 -2.753175 -0.697539
H  -2.637665 -2.249579 1.11683
H  -2.23043 -0.522416 1.02871
H  -3.354675 -2.182591 -1.320693
H  -3.012663 -0.435419 -1.370841
H  -5.144571 -1.746017 0.495505
H  -6.466548 0.268878 -0.029077
H  -5.087399 0.919119 -1.108419
H  -1.229403 5.202275 0.981243
