program: Gaussian 09
title: 000180078
version: EM64L-G09RevD.01
frameworkgroup: C1[X(C10H19O3PS)]
method: RPBEPBE
basis: SDD
operation: Freq
keyword: #p
keyword: freq=noraman
keyword: PBEPBE/SDD
title: #p freq=noraman PBEPBE/SDD
converged: YES YES NO NO
title: Mulliken charges:
elementType: S P O O O C C C C C C C C C C H H H H H H H H H H H H H H H H H H H
charge: -0.155024 0.871481 -0.470417 -0.430154 -0.428974 0.070910 0.027811 -0.457908 -0.317036 -0.322651 -0.083925 -0.379881 -0.717922 -0.704937 -0.689742 0.215482 0.205186 0.204901 0.235847 0.223543 0.235106 0.234650 0.196984 0.207334 0.216238 0.245201 0.219373 0.201411 0.241236 0.207003 0.246431 0.213071 0.212904 0.226467
chargesum: 0.00000
title: Mulliken charges with hydrogens summed into heavy atoms:
elementType: S P O O O C C C C C C C C C C
charge: -0.155024 0.871481 -0.470417 -0.430154 -0.428974 0.070910 0.243294 -0.047821 0.142354 0.147105 0.113059 0.043691 -0.051937 -0.010267 -0.037300
polarizability: 2.05640549e+02 -2.32204715e+00 1.35629998e+02 5.57511350e+00 -2.78769070e-01 1.18320265e+02
1716.lowfreq: -30.0494 -11.1882 -0.0010 0.0019 0.0023 6.5433 22.6330 56.0503 69.9511
frequency: 14.2545 55.8588 69.9383 85.0200 94.2472 128.1061 161.2013 175.4953 185.3343 197.4265 228.9309 244.9731 250.6107 261.1138 268.0305 304.5452 310.6491 323.9665 353.9871 381.3589 393.9940 412.2713 454.5980 506.3289 539.1600 596.8425 635.0441 644.1482 670.2988 736.4239 742.8928 794.1232 835.0390 858.4379 863.7620 882.6677 907.5298 911.8990 923.1589 931.2007 953.9748 959.8549 1015.4650 1042.1750 1049.3892 1070.0190 1093.7947 1114.0243 1130.4878 1148.4022 1155.2066 1186.9404 1200.7388 1223.3355 1262.3322 1273.5235 1286.3976 1298.1342 1314.1960 1319.0064 1327.4417 1343.0408 1356.1856 1362.6090 1384.1611 1395.9542 1404.8355 1456.0473 1461.7900 1463.6203 1469.9907 1473.4544 1478.3248 1480.0621 1483.6102 1487.7863 1492.1922 2962.2111 2963.8370 2976.6738 2977.8605 2982.0079 2995.8946 2999.7081 3001.5783 3005.6360 3010.6021 3038.9437 3070.0878 3074.2955 3075.1287 3077.7952 3081.7476 3083.1638 3088.8574 3108.2112
redmass: 2.3323 2.5740 1.9413 5.4751 5.4379 6.0388 3.0269 1.3149 2.5222 3.2751 1.4218 1.3108 1.8558 3.5395 3.3061 2.2538 6.6275 6.8729 4.4822 3.0808 6.5005 3.4613 3.4932 2.9314 8.1101 4.0264 5.2835 7.6678 6.9735 1.6589 2.4723 3.5476 3.1311 1.6583 3.3486 3.2488 3.9114 1.3228 1.6453 1.7540 4.1105 1.5906 1.9669 1.8093 2.6009 2.1981 1.6817 2.3050 3.0255 1.4606 1.4905 1.8810 1.6728 1.4255 1.2820 1.3270 1.2552 1.3922 1.1826 1.2721 1.4687 1.3491 1.3711 1.4180 1.2014 1.2086 1.1995 1.0797 1.0679 1.0560 1.0692 1.0562 1.0580 1.0464 1.0466 1.0808 1.0598 1.0663 1.0745 1.0377 1.0361 1.0603 1.0409 1.0660 1.0646 1.0704 1.0967 1.1019 1.0989 1.1030 1.1047 1.1071 1.0993 1.1001 1.0991 1.0989
irintensity: 0.0548 0.2387 0.2603 0.8525 0.2898 0.5030 1.7387 0.2118 1.3540 1.0973 0.6206 0.4382 2.5185 1.9065 1.9104 2.7100 12.3034 12.3055 5.8188 2.7027 5.3870 0.1824 0.6886 6.6010 6.8614 15.2629 31.0895 80.7674 71.1650 76.6469 138.4699 21.9302 99.3763 20.1263 22.0864 39.0208 73.0833 3.7472 4.4246 13.2305 179.4507 16.3994 25.3473 2.4292 0.8825 26.4506 5.6482 1.2189 5.5442 0.3053 0.5565 3.5275 4.1943 0.2449 0.8029 0.2088 0.3950 1.6575 3.8046 2.1404 0.7637 10.7119 6.1408 2.0941 18.0839 10.7997 19.7043 3.4141 5.2690 0.8986 1.2126 5.8453 4.3926 15.1235 20.3889 22.0697 16.9397 4.3697 34.0682 27.3472 41.2223 28.5052 31.9671 46.4113 18.7138 53.0150 4.9713 21.0444 44.6488 26.6253 36.8476 36.5935 40.9661 1.7064 55.1074 24.4433
temp: 298.150 k
press: 1.00000 atm
elementType: 16 15 8 8 8 6 6 6 6 6 6 6 6 6 6 1 1 1 1 1 1 1 1 1 1 1 1 1 1 1 1 1 1 1
symmnumber: 1
zpe: 737662.9 jmol-1
zpe.correction: 0.280961 hartree
zpe.thermalcorrener: 0.298353 hartree
zpe.thermalcorrenthalpy: 0.299297 hartree
zpe.thermalcorrgfe: 0.235353 hartree
zpe.sumelectzpe: -1356.187754 hartree
zpe.sumelectthermal: -1356.170361 hartree
zpe.sumelectthermalent: -1356.169417 hartree
zpe.sumelectthermalfe: -1356.233362 hartree
dipole: 7.8920 0.1990 0.9060
dipole: 7.9463
quadrupole: -116.7929 -106.3970 -108.8165
quadrupole: -4.8447 -0.4335 -0.5696
quadrupole: -6.1241 4.2718 1.8523 -4.8447 -0.4335 -0.5696
hfenergy: -1356.4687145 hartree
pointgroup: C01 [X(C10H19O3P1S1)]
dipole: 3.1127789 0.2239488 0.1852367 debye
polarizability: 206.052922|0.9764515|135.5670105|0.7287194|-0.0276859|117.9708802 unknown
InChI: InChI=1S/C10H19O3PS/c1-4-5-10-6-11-14(15,12-7-10)13-9(10)8(2)3/h8-9H,4-7H2,1-3H3
charge 0 multiplicity 1
34 atoms
S  -4.26548 -0.60892 -0.128762
P  -2.249834 -0.63146 0.063365
O  -1.340596 0.566332 -0.823948
O  -1.590946 -0.423445 1.672508
O  -1.394013 -2.090681 -0.405966
C  0.553256 -0.638946 0.326981
C  0.127373 0.659622 -0.445139
C  2.093992 -0.714669 0.543657
C  -0.129326 -0.749468 1.720477
C  0.082236 -1.8552 -0.531092
C  0.418079 2.060771 0.162624
C  2.973846 -0.752805 -0.730112
C  0.49238 3.092941 -0.992663
C  -0.596697 2.545652 1.226064
C  4.473086 -0.857309 -0.376087
H  0.62748 0.617233 -1.432007
H  2.307621 -1.62472 1.142893
H  2.410795 0.143185 1.170055
H  -0.02518 -1.777518 2.116618
H  0.301761 -0.035143 2.441783
H  0.307376 -1.706071 -1.602839
H  0.542976 -2.794825 -0.178854
H  1.42401 2.002893 0.631119
H  2.805523 0.157137 -1.338251
H  2.689808 -1.614534 -1.365177
H  -0.471909 3.133355 -1.530947
H  0.708807 4.103654 -0.602386
H  1.282895 2.833964 -1.7226
H  -1.601844 2.63577 0.779456
H  -0.29276 3.543522 1.591623
H  -0.683001 1.87313 2.093793
H  4.802286 0.010793 0.225167
H  4.679535 -1.770843 0.212634
H  5.098664 -0.894195 -1.285685
