program: Gaussian 09
title: 000180060
version: EM64L-G09RevD.01
frameworkgroup: C1[X(C16H16O4)]
method: RPBEPBE
basis: SDD
operation: Freq
keyword: #pfreq=noraman
keyword: PBEPBE/SDD
title: #p freq=noraman PBEPBE/SDD
converged: NO YES NO NO
title: Mulliken charges:
elementType: O O O O C C C C C C C C C C C C C C C C H H H H H H H H H H H H H H H H
charge: -0.254599 -0.254949 -0.276055 -0.206244 -0.254100 0.473475 0.351167 0.014177 -0.556063 0.093948 -0.670548 0.487761 0.051712 -0.690126 -0.690269 -0.275645 -0.201911 -0.315498 0.124147 -0.680999 0.221763 0.272907 0.255864 0.235520 0.218489 0.222653 0.222646 0.218364 0.235806 0.245784 0.228854 0.228519 0.252623 0.211954 0.229430 0.229444
chargesum: 0.00000
title: Mulliken charges with hydrogens summed into heavy atoms:
elementType: O O O O C C C C C C C C C C C C C C C C
charge: -0.254599 -0.254949 -0.276055 -0.206244 -0.032337 0.473475 0.351167 0.014177 -0.283155 0.093948 -0.414684 0.487761 0.051712 -0.013464 -0.013453 -0.029861 0.255463 -0.062876 0.124147 -0.010172
polarizability: 3.18846666e+02 -8.50506736e-01 2.03704975e+02 3.41415445e-02 -1.25687302e-02 1.00952277e+02
1716.lowfreq: -22.3947 -4.6002 -0.2223 -0.0005 0.0006 0.0007 5.9511 41.1639 54.2085
frequency: -22.2723 40.9533 54.0868 76.3816 88.9772 92.1730 128.6781 128.7852 159.5759 188.5394 201.0266 201.3996 241.4860 243.8893 252.0972 268.4645 308.9309 318.1421 354.7134 377.4967 396.9115 406.5966 433.4590 469.5144 478.5590 549.9460 564.0232 577.9169 632.8663 635.5015 649.9429 672.5184 700.6320 720.4417 747.0741 779.0787 802.0620 805.7022 810.5690 833.2734 834.5067 864.5906 877.5637 892.8746 924.5367 955.6486 957.4694 987.9503 1006.8682 1029.5914 1045.0343 1095.8583 1106.6607 1108.8403 1115.6038 1125.7344 1131.7610 1169.5067 1183.7050 1207.3712 1226.8955 1254.5765 1255.2718 1293.8983 1314.5732 1332.3945 1360.4854 1377.3064 1393.1136 1395.7547 1402.2524 1409.5271 1425.4176 1456.9728 1460.1953 1464.7661 1467.6853 1471.8936 1478.4564 1485.0971 1490.9980 1576.1982 1598.4952 1611.4552 1622.3269 1683.0112 2985.2626 2986.7417 2995.1780 3001.8060 3023.7540 3081.9133 3084.6613 3085.8703 3091.2994 3093.6546 3097.1685 3113.4047 3131.5477 3154.7908 3187.3105 3223.7302
redmass: 3.5847 3.8480 3.4012 1.9587 3.4037 4.7580 4.2608 4.9983 7.7882 5.5490 1.8525 1.3659 1.2447 1.1170 4.1577 4.9303 3.7305 3.9127 6.4906 3.9783 3.9092 5.9822 5.4983 4.0789 6.1914 6.3151 4.2903 4.1549 3.9963 5.2133 5.4064 4.2613 5.8227 7.4204 4.8305 6.2414 6.9697 1.0933 1.3583 1.5078 4.4096 3.6794 1.6554 4.3831 1.1752 6.1295 1.4799 1.3298 2.2020 1.8066 3.8142 3.6976 5.5137 2.5076 2.2609 1.4255 1.5409 1.9409 2.0808 1.5172 1.9232 4.4850 1.1447 1.3263 1.7114 2.0540 1.4293 1.1885 1.6030 1.2112 1.7571 6.0264 7.7352 3.6777 1.0402 1.0440 1.1661 1.0490 1.0452 1.0675 1.0705 9.1682 7.6410 7.5369 8.3711 10.7055 1.0347 1.0354 1.0356 1.0840 1.0580 1.1007 1.1051 1.1000 1.1010 1.0984 1.1000 1.1053 1.0904 1.0928 1.0954 1.0984
irintensity: 10.0043 0.9809 0.0746 0.0518 0.7118 1.6423 1.6548 0.7687 0.0106 0.7460 0.0641 0.0413 0.2423 0.1858 0.1012 0.3381 3.5558 0.7140 0.9388 0.3876 0.0080 11.6826 1.0396 2.8679 2.0210 0.0932 6.2281 5.9560 4.6306 0.1480 8.5216 4.7410 0.6770 47.5952 9.1305 9.2553 8.1125 4.6654 21.2071 0.2268 2.8408 6.7486 81.6798 32.6822 6.1129 103.6816 0.0063 0.7995 27.0715 103.8681 67.9773 138.1242 131.1273 1.9334 6.9091 6.2054 1.1650 47.4592 21.2562 1.8054 7.8166 5.0472 0.0169 0.0765 23.2628 142.1564 16.1727 16.3568 78.7358 22.1043 26.1648 80.5830 63.7671 34.9705 12.6514 5.2559 3.7105 1.9070 15.8690 7.4566 11.9159 134.5812 46.3019 18.0190 37.4610 604.6893 30.8556 36.2360 20.9001 17.0057 15.0638 14.4856 0.4719 70.1894 7.7651 26.7214 48.1723 50.5679 11.0624 4.3057 3.1664 5.2471
temp: 298.150 k
press: 1.00000 atm
elementType: 8 8 8 8 6 6 6 6 6 6 6 6 6 6 6 6 6 6 6 6 1 1 1 1 1 1 1 1 1 1 1 1 1 1 1 1
symmnumber: 1
zpe: 739658.1 jmol-1
zpe.correction: 0.281721 hartree
zpe.thermalcorrener: 0.299704 hartree
zpe.thermalcorrenthalpy: 0.300648 hartree
zpe.thermalcorrgfe: 0.235983 hartree
zpe.sumelectzpe: -918.734670 hartree
zpe.sumelectthermal: -918.716687 hartree
zpe.sumelectthermalent: -918.715743 hartree
zpe.sumelectthermalfe: -918.780407 hartree
dipole: -4.2220 -2.9385 0.0008
dipole: 5.1439
quadrupole: -125.0965 -100.1431 -118.9080
quadrupole: -5.1222 -0.0269 -0.0195
quadrupole: -10.3806 14.5728 -4.1922 -5.1222 -0.0269 -0.0195
hfenergy: -919.0163906 hartree
pointgroup: C01 [X(C16H16O4)]
dipole: 1.5705649 1.2732403 0.0884039 debye
polarizability: 317.5987736|7.4824802|204.1829249|12.8975059|-0.0228266|101.7222206 unknown
InChI: InChI=1S/C16H16O4/c1-4-18-16-14-10(5-6-13(17)20-14)7-11-8-12(9(2)3)19-15(11)16/h5-9H,4H2,1-3H3
charge 0 multiplicity 1
36 atoms
O  2.284175 -0.290965 -0.004304
O  0.069593 -2.036215 -0.129865
O  -2.593884 -0.743061 -0.293809
O  -4.883761 -0.942424 -0.427543
C  4.584269 0.633065 0.133642
C  3.105483 0.882618 0.041623
C  0.931173 1.592647 -0.093614
C  0.960841 0.165114 -0.086397
C  2.321947 2.016975 -0.0109
C  -0.17484 -0.673098 -0.150634
C  -0.309044 2.253274 -0.170629
C  -1.485411 1.462669 -0.237634
C  -1.416302 0.024459 -0.227403
C  5.105075 -0.127342 -1.117387
C  4.944546 -0.131584 1.437525
C  -2.802714 2.05968 -0.318078
C  -1.02656 -3.054596 -0.191697
C  -3.953217 1.306862 -0.383165
C  -3.921515 -0.15137 -0.375624
C  -0.324727 -4.407305 -0.141137
H  5.066864 1.629522 0.165236
H  2.689165 3.041119 0.007572
H  -0.383746 3.344871 -0.179516
H  4.629677 -1.121222 -1.189921
H  6.19875 -0.269312 -1.046815
H  4.885541 0.428404 -2.046397
H  4.613212 0.422607 2.333735
H  6.038113 -0.276895 1.502291
H  4.460776 -1.123963 1.447529
H  -2.869489 3.154273 -0.326189
H  -1.708496 -2.904753 0.662246
H  -1.597614 -2.914239 -1.1250
H  -4.94525 1.760827 -0.443623
H  -1.07823 -5.214945 -0.182386
H  0.363672 -4.526379 -0.995292
H  0.254529 -4.515721 0.791759
