program: Gaussian 09
title: 000180058
version: EM64L-G09RevD.01
frameworkgroup: C1[X(C15H16O5)]
method: RPBEPBE
basis: SDD
operation: Freq
keyword: #pfreq=noraman
keyword: PBEPBE/SDD
title: #p freq=noraman PBEPBE/SDD
converged: YES YES NO NO
title: Mulliken charges:
elementType: O O O O O C C C C C C C C C C C C C C C H H H H H H H H H H H H H H H H
charge: -0.311831 -0.454905 -0.248393 -0.217184 -0.197793 -0.087080 0.259344 -0.554576 0.298581 0.095017 -0.728574 -0.719121 -0.652610 0.069501 0.483739 0.038822 -0.280889 -0.315762 0.115644 -0.516481 0.234897 0.271672 0.236631 0.236198 0.237864 0.206728 0.242897 0.242036 0.204177 0.253077 0.351288 0.246416 0.251777 0.219972 0.246686 0.242232
chargesum: 0.00000
title: Mulliken charges with hydrogens summed into heavy atoms:
elementType: O O O O O C C C C C C C C C C C C C C C
charge: -0.311831 -0.103617 -0.248393 -0.217184 -0.197793 0.147817 0.259344 -0.046273 0.298581 0.095017 -0.047784 -0.030010 -0.399533 0.069501 0.483739 0.038822 -0.034472 -0.063985 0.115644 0.192410
polarizability: 3.00747837e+02 6.45047723e-02 1.84749470e+02 -1.47325022e+01 4.19330682e+00 1.01276981e+02
1716.lowfreq: -3.6844 -0.0004 0.0002 0.0008 3.1415 13.0932 31.5954 53.8850 59.9814
frequency: 31.2603 53.8379 59.9706 72.5589 99.3298 119.6872 140.5265 167.7019 175.5125 183.3018 194.4432 220.0264 231.7947 234.5187 273.2292 288.0882 315.1802 350.8596 364.4367 373.2531 389.4235 404.4954 411.1961 443.2745 472.6237 491.4618 520.5721 532.9193 562.4479 590.3309 615.0990 616.9420 652.0408 691.4358 702.7891 755.4738 763.0538 767.2001 802.8107 818.6080 823.5963 876.6194 898.7366 903.9504 926.8726 935.8918 947.2966 970.7890 984.0533 995.0121 1033.5128 1047.9834 1058.4692 1106.1631 1111.0988 1113.2852 1154.2140 1155.1328 1173.6945 1183.1002 1209.4800 1232.1172 1234.7025 1255.5797 1269.4303 1301.9717 1322.1794 1350.4481 1378.0107 1390.5207 1396.2406 1405.0126 1427.6744 1441.3379 1449.6562 1454.4665 1457.7290 1461.6126 1466.8727 1473.9708 1476.7722 1488.3640 1565.8964 1610.3253 1620.9709 1688.7085 2982.1289 2986.0306 2996.4466 2997.4730 3010.3541 3071.0652 3081.9905 3084.2570 3096.4999 3099.2915 3105.1010 3131.8563 3134.7622 3144.4940 3187.4407 3528.9605
redmass: 5.2143 3.3069 2.8780 5.9447 4.0029 2.8791 4.4896 1.8187 6.0451 1.0908 3.1986 2.0697 1.5088 4.7769 2.4894 3.5893 4.0095 4.8397 2.6375 5.0763 4.1665 4.7584 3.7881 1.1664 5.4909 4.5225 5.8725 3.9990 3.6998 3.9164 5.8266 6.3441 4.0861 5.7368 7.4361 5.3571 6.7363 5.7571 6.3374 3.7261 1.5227 1.5158 7.6959 3.4100 1.8466 1.6583 4.0470 1.9284 1.3319 1.4496 3.4939 2.4902 5.3155 3.3112 1.7776 1.2404 1.5315 1.5699 1.9151 1.4121 1.4626 2.2443 2.0360 1.4825 1.4609 3.0870 1.7611 1.7512 1.2455 2.5577 1.2420 3.3595 7.3125 1.4162 1.2921 1.0692 1.3390 1.6005 1.1265 1.0553 1.0694 1.0559 8.9567 7.4046 8.1922 10.8321 1.0321 1.0362 1.0533 1.0454 1.0855 1.1004 1.0985 1.1021 1.1001 1.1002 1.0995 1.0905 1.1031 1.0927 1.0953 1.0651
irintensity: 0.6962 0.1765 11.1182 1.5796 0.3022 3.2333 2.9177 0.7537 4.0697 0.8076 0.6994 1.7640 1.3336 0.8201 3.0233 6.8531 1.1086 0.8745 1.3900 2.8041 23.4970 20.5367 6.7286 181.7808 9.4915 9.7077 9.3558 14.1088 21.8654 9.9348 1.2895 2.1742 3.3490 7.1190 44.8888 1.3136 6.0026 21.9551 3.5241 11.0709 13.9380 42.2055 14.8208 21.3033 16.5548 24.0000 211.8897 22.6841 0.5824 15.5212 37.2668 6.8779 156.8496 89.2374 63.7068 2.9719 17.4057 12.7737 38.2738 1.7506 9.6011 33.5586 6.0519 40.3990 14.0902 139.5658 26.7833 17.1119 44.2351 84.7182 36.4278 44.0805 145.2326 17.2778 9.3581 4.6206 22.1732 10.1848 6.4036 16.5855 3.5204 19.7148 105.9973 11.4352 215.8441 558.1995 63.6614 18.4168 1.3238 24.3941 40.9313 13.3070 22.4332 30.1214 17.7592 26.9756 38.7517 10.4545 15.6252 6.0870 2.6671 4.8371
temp: 298.150 k
press: 1.00000 atm
elementType: 8 8 8 8 8 6 6 6 6 6 6 6 6 6 6 6 6 6 6 6 1 1 1 1 1 1 1 1 1 1 1 1 1 1 1 1
symmnumber: 1
zpe: 734635.1 jmol-1
zpe.correction: 0.279808 hartree
zpe.thermalcorrener: 0.298745 hartree
zpe.thermalcorrenthalpy: 0.299689 hartree
zpe.thermalcorrgfe: 0.233019 hartree
zpe.sumelectzpe: -955.821337 hartree
zpe.sumelectthermal: -955.802399 hartree
zpe.sumelectthermalent: -955.801455 hartree
zpe.sumelectthermalfe: -955.868125 hartree
dipole: 6.4355 -3.3912 -3.3537
dipole: 8.0102
quadrupole: -137.6785 -105.4837 -118.7737
quadrupole: 19.3259 -4.1124 -0.6215
quadrupole: -17.0332 15.1616 1.8716 19.3259 -4.1124 -0.6215
hfenergy: -956.1011445 hartree
pointgroup: C01 [X(C15H16O5)]
dipole: -2.5093577 -1.3742248 1.3214544 debye
polarizability: 300.1701304|0.3473911|184.9294382|-18.2190594|-1.5908557|101.6747191 unknown
InChI: InChI=1S/C15H16O5/c1-15(2,17)10-7-9-6-8-4-5-11(16)20-12(8)14(18-3)13(9)19-10/h4-6,10,17H,7H2,1-3H3
charge 0 multiplicity 1
36 atoms
O  -1.842441 0.787813 0.283571
O  -3.803157 -0.241274 -1.566516
O  0.741657 2.29098 -0.139581
O  3.020642 0.824951 -0.193859
O  5.319799 0.855958 -0.414807
C  -2.822718 -0.30889 0.6887
C  -4.118761 -0.083016 -0.129961
C  -2.07684 -1.645143 0.422162
C  -0.619351 -1.221852 0.321686
C  -0.569299 0.19359 0.216142
C  -4.699128 1.324259 0.133477
C  -5.147876 -1.182658 0.181583
C  0.551316 -1.97306 0.240083
C  0.632313 0.91481 0.041284
C  1.796482 -1.2979 0.060738
C  1.822808 0.129787 -0.034544
C  3.060581 -1.992389 -0.02707
C  4.251094 -1.317366 -0.190937
C  4.311656 0.138077 -0.280112
C  -0.057572 3.165166 0.746379
H  -3.015925 -0.152178 1.767248
H  -2.420989 -2.078856 -0.535939
H  -2.259469 -2.376867 1.226877
H  -3.956717 2.108338 -0.097275
H  -5.585093 1.47791 -0.505753
H  -5.005041 1.441906 1.189492
H  -4.751996 -2.179361 -0.075395
H  -6.053426 -1.012573 -0.424671
H  -5.431734 -1.171577 1.249146
H  0.534181 -3.066322 0.301646
H  -3.127837 0.448408 -1.802156
H  3.059342 -3.086886 0.040136
H  5.210165 -1.836442 -0.259208
H  0.216801 2.991122 1.803734
H  -1.138857 2.998095 0.605799
H  0.221493 4.186636 0.450001
