program: Gaussian 09
title: 000016083
version: EM64L-G09RevD.01
frameworkgroup: C1[X(C4H3Cl2N3)]
method: RPBEPBE
basis: SDD
operation: Freq
keyword: #p
keyword: freq=noraman
keyword: PBEPBE/SDD
title: #p freq=noraman PBEPBE/SDD
converged: YES YES NO NO
title: Mulliken charges:
elementType: Cl Cl N N N C C C C H H H
charge: 0.052169 0.052314 0.045409 0.047267 0.140524 0.130725 -0.724365 -0.255620 -0.256631 0.256644 0.255915 0.255650
chargesum: 0.00000
title: Mulliken charges with hydrogens summed into heavy atoms:
elementType: Cl Cl N N N C C C C
charge: 0.052169 0.052314 0.045409 0.047267 0.140524 0.130725 0.043844 -0.255620 -0.256631
polarizability: 1.13622528e+02 -1.62283460e-01 9.64501171e+01 -2.58567021e-03 6.84954834e-01 3.66252443e+01
1716.lowfreq: -36.6548 -7.1053 -5.9141 -0.0041 -0.0035 -0.0009 5.1167 138.8112 147.7624
frequency: -36.5981 138.8111 147.7622 176.6675 199.8773 248.2473 379.9747 423.2187 472.2008 551.5795 590.6501 632.4009 785.9789 791.1772 876.3707 898.5856 993.5570 1048.7328 1172.3935 1206.9773 1213.0800 1348.1127 1400.2439 1405.8478 1437.6170 1462.0826 1467.7479 2998.2884 3090.9183 3142.8176
redmass: 1.0163 11.2646 14.6683 4.7038 20.7202 3.6707 21.9306 13.1662 5.3434 5.7892 4.0551 12.3634 11.2520 7.9927 9.3064 10.2912 1.8182 1.6659 7.5637 12.2784 6.5733 3.9843 1.4134 4.4684 1.5990 1.2467 2.4420 1.0423 1.0894 1.1025
irintensity: 0.6345 0.0980 0.0020 1.3915 0.0486 2.9977 3.9277 8.5644 2.1809 16.7881 1.9687 0.0007 150.4277 2.5137 28.1011 7.9348 19.9076 13.0288 4.4151 88.6126 210.5671 19.5025 29.3929 578.4351 215.5272 46.1734 292.0117 0.2127 6.4089 3.2590
temp: 298.150 k
press: 1.00000 atm
elementType: 17 17 7 7 7 6 6 6 6 1 1 1
symmnumber: 1
zpe: 183638.3 jmol-1
zpe.correction: 0.069944 hartree
zpe.thermalcorrener: 0.077532 hartree
zpe.thermalcorrenthalpy: 0.078476 hartree
zpe.thermalcorrgfe: 0.036363 hartree
zpe.sumelectzpe: -1237.927626 hartree
zpe.sumelectthermal: -1237.920039 hartree
zpe.sumelectthermalent: -1237.919095 hartree
zpe.sumelectthermalfe: -1237.961208 hartree
dipole: -0.0153 2.6768 0.0850
dipole: 2.6782
quadrupole: -71.7433 -61.2892 -63.6272
quadrupole: -0.0613 -0.0001 0.2965
quadrupole: -6.1901 4.2640 1.9260 -0.0613 -0.0001 0.2965
hfenergy: -1237.9975706 hartree
pointgroup: C01 [X(C4H3Cl2N3)]
dipole: -0.0043688 -1.0532939 -0.0286528 debye
dipolederiv: -0.7322265 0.3622234 -0.0023219 0.3838048 -0.2901201 0.0017361 -0.0033554 0.0027479 -0.0478279 -0.7319704 -0.3621486 0.0017439 -0.3851063 -0.290963 0.0014189 0.0028904 0.0025168 -0.0478487 -0.7770034 -0.2820247 -0.0090693 -0.497363 -1.2047942 0.000194 0.0028415 0.007047 -0.114984 -0.7770796 0.2854831 0.0085641 0.4974082 -1.207629 0.0007796 -0.0029046 0.0067385 -0.1163746 -1.6244679 -0.0003205 -0.0006218 -0.0003987 -0.496459 0.000315 -0.0006814 0.005684 -0.0845094 0.8619479 0.0063962 0.000453 0.0027418 1.3429528 0.028555 0.000383 0.0674339 0.1074444 0.0002954 -0.0364618 0.0000367 -0.0060198 -0.4586061 -0.0360222 -0.0001456 -0.1988948 -0.0321213 1.8267192 -0.4685588 0.0027495 -0.5024335 1.1812929 -0.0022371 0.0108361 -0.0160105 0.0936435 1.8259618 0.468814 -0.0013557 0.5057668 1.1839438 -0.0017651 -0.0096067 -0.015645 0.095373 -0.0136676 0.0469661 -0.0752754 0.0105544 0.0814716 0.0153093 -0.0597124 0.0726156 0.1025255 0.0026732 -0.0265896 0.0878956 -0.0085206 0.0815897 0.0181282 0.0702458 0.0795409 0.0871866 0.138818 0.0062213 -0.0127987 -0.0004341 0.0773206 -0.0264117 -0.0107908 -0.0137742 -0.0425071 unknown
polarizability: 113.6219685|0.188777|96.4556639|0.0334606|0.4123046|36.6202574 unknown
InChI: InChI=1S/C4H3Cl2N3/c1-2-7-3(5)9-4(6)8-2/h1H3
charge 0 multiplicity 1
12 atoms
Cl -2.684923 1.545506 -0.010287
Cl 2.684051 1.549663 -0.008054
N  1.212632 -0.706199 0.013338
N  -1.209736 -0.707895 0.012282
N  -0.00027 1.389931 -0.00422
C  0.002137 -1.36074 0.018341
C  0.001576 -2.858703 0.010015
C  -1.131501 0.640915 -0.000406
C  1.131893 0.643066 0.000696
H  0.934927 -3.245152 0.445762
H  -0.876601 -3.245251 0.549804
H  -0.063085 -3.224242 -1.032971
