program: Gaussian 09
title: 000180073
version: EM64L-G09RevD.01
frameworkgroup: C1[X(C18H24N2O9)]
method: RPBEPBE
basis: SDD
operation: Freq
keyword: #p
keyword: freq=noraman
keyword: PBEPBE/SDD
title: #p freq=noraman PBEPBE/SDD
converged: YES YES NO NO
title: Mulliken charges:
elementType: O O O O O O O O O N N C C C C C C C C C C C C C C C C C C H H H H H H H H H H H H H H H H H H H H H H H H
charge: -0.334830 -0.467773 -0.465125 -0.473357 -0.431729 -0.283963 -0.155942 -0.409611 -0.216911 -0.439184 -0.477448 -0.159230 -0.087349 -0.118869 -0.036766 -0.018843 -0.376006 -0.007520 0.336379 -0.404913 0.201764 0.287169 0.152389 -0.721360 -0.348155 -0.383511 -0.247216 -0.244694 -0.236322 0.226864 0.223510 0.229065 0.242665 0.245756 0.192408 0.258174 0.338788 0.376498 0.370569 0.387953 0.206808 0.238808 0.343450 0.342178 0.238665 0.252099 0.212117 0.283011 0.261841 0.238349 0.234778 0.238394 0.386180
chargesum: 0.00000
title: Mulliken charges with hydrogens summed into heavy atoms:
elementType: O O O O O O O O O N N C C C C C C C C C C C C C C C C C C
charge: -0.334830 -0.091275 -0.094556 -0.085404 -0.089551 -0.283963 -0.155942 -0.023431 -0.216911 -0.100396 -0.133998 0.067634 0.136160 0.110197 0.205899 0.226913 0.074576 -0.007520 0.336379 0.040702 0.201764 0.287169 0.152389 -0.018479 -0.065143 -0.121671 -0.008867 -0.009916 0.002072
polarizability: 2.61559885e+02 -1.10302933e+01 2.61564803e+02 -1.25987149e+01 -2.12133062e+00 1.87577668e+02
1716.lowfreq: -0.0007 -0.0005 -0.0002 2.0284 4.3699 6.8714 13.2707 18.2464 25.5702
frequency: 12.4685 18.0713 25.5401 39.8605 44.8291 58.7171 67.7376 72.8285 77.6113 91.5480 103.6580 116.1194 119.6965 136.6205 148.0841 163.6945 167.2638 183.5434 198.2951 215.0864 221.2010 226.0558 254.9392 267.0461 271.3874 291.6688 311.5019 323.6126 330.2179 337.1264 344.4220 370.7119 388.0392 403.4466 403.8969 418.8145 435.8119 453.7977 475.1069 483.3241 496.5863 500.1777 506.8462 518.4185 556.6347 568.8566 589.8684 602.9973 613.5798 616.1192 624.8707 645.1175 684.0251 694.9756 703.6658 710.3209 724.0931 756.7923 769.6450 790.7067 817.5630 861.0547 867.2347 901.3669 927.9427 944.7737 952.3210 955.2758 968.2946 981.1399 987.9324 990.5053 992.1231 1005.1357 1006.6155 1020.7771 1031.5209 1037.4919 1040.5420 1047.8925 1062.6807 1063.3836 1071.6327 1084.8791 1089.0653 1099.1732 1117.3957 1120.0697 1152.4907 1167.7096 1177.3885 1179.4741 1183.8613 1192.1028 1202.0982 1228.0682 1236.2983 1243.2274 1259.6962 1279.8896 1280.8705 1286.4310 1302.4559 1307.4787 1321.2390 1325.6859 1332.4999 1338.3618 1343.3140 1360.4524 1375.7060 1380.0230 1390.4101 1398.3772 1405.6363 1415.9024 1433.8333 1449.7080 1461.8843 1466.5750 1473.0266 1479.8932 1482.5476 1484.3978 1585.3313 1605.8713 1623.6559 1645.0747 1677.1910 2942.0039 2953.5612 2964.5108 2966.6113 2980.5008 2989.8860 2995.5063 2998.7770 3058.0097 3088.8042 3108.9315 3112.7654 3129.3464 3136.6223 3148.3705 3162.1330 3173.3742 3187.8948 3488.3080 3509.6106 3524.4738 3542.2428 3544.1286 3551.8754
redmass: 5.9324 6.1002 6.6457 6.4019 4.4963 6.4278 6.7420 6.0096 6.2406 5.6212 6.7575 6.0054 3.1776 5.7135 2.3747 3.4446 4.3023 3.5731 2.3316 5.6856 4.5925 4.0164 3.8942 6.7570 4.4717 4.5102 4.2535 3.1475 5.1801 6.0787 5.5963 4.8161 4.8410 1.9435 2.8529 2.2827 1.3675 1.8854 1.2500 4.6563 3.2874 3.0598 2.1267 2.1007 3.2489 3.2244 3.0186 3.5603 2.8214 4.4243 1.3785 2.4927 6.8321 4.6133 3.0909 2.3787 5.3154 1.7150 1.1611 1.6959 2.5083 1.4878 2.5930 3.2756 2.4363 2.1583 5.2943 2.2401 4.9784 4.9652 1.8553 2.9471 3.0392 1.3757 6.1331 3.3174 2.3229 3.9129 2.5251 4.7036 2.7005 2.8019 2.5611 3.5974 2.2229 3.1380 2.2823 2.2164 2.2095 2.5870 1.0653 1.3516 2.8806 1.3210 1.1292 1.1751 1.4703 1.1778 1.3106 1.5061 1.2193 1.2424 1.2721 1.5293 1.2715 1.3664 1.4401 1.2492 1.2405 1.3150 5.9925 1.3143 1.6141 1.7158 1.2023 1.7599 2.2058 1.5019 1.0808 1.1729 1.9830 1.1040 1.8606 1.0627 5.8326 5.8091 5.1560 8.0021 10.1749 1.0831 1.0810 1.0713 1.0832 1.0855 1.0604 1.0846 1.0383 1.0995 1.0983 1.1008 1.0939 1.0861 1.0884 1.0936 1.0961 1.0989 1.0683 1.0767 1.0639 1.0773 1.0657 1.0653 1.0655
irintensity: 0.2175 0.4951 0.4391 4.2283 0.2543 1.6631 1.8189 2.9727 2.8143 3.0009 1.8605 1.4540 1.4136 6.3814 3.6711 1.5763 1.8724 0.5558 6.3455 5.9217 1.1946 3.3928 2.6717 4.9193 9.4833 3.4190 0.6958 0.2596 9.1090 0.7228 4.8895 6.5992 6.4051 29.9970 0.0664 62.2921 191.3642 9.3065 180.2877 23.3334 28.2040 3.2011 21.6817 36.4168 35.3098 10.8724 134.4343 6.4903 47.9375 40.6085 81.8765 47.6840 5.8446 11.1524 31.1415 58.5959 9.9922 15.7396 167.2321 26.8814 74.9764 2.0400 5.8680 7.1001 0.8869 4.0437 76.8107 3.2807 7.2469 151.2958 0.3503 3.6132 32.1675 4.0669 86.8150 21.4218 10.0589 211.8206 266.5347 9.4275 136.1497 51.7517 4.9347 57.6510 7.0555 21.4419 5.5581 10.8861 38.2490 104.4400 3.8532 18.7433 73.2527 8.0332 2.3122 30.5514 39.9950 15.6442 30.5309 13.3309 15.3528 1.4596 45.3914 20.3181 8.0404 2.6875 21.6943 80.9825 72.3138 16.4024 1.0256 39.1329 21.8922 87.6599 18.7998 450.5239 12.0580 132.0674 5.3026 38.3956 503.2366 111.6366 19.5670 4.3814 3.2376 8.2402 0.3918 184.6704 293.2820 13.0165 10.9018 26.0720 4.1144 32.6183 29.9906 125.9330 25.5808 8.3675 24.9163 26.7040 7.2196 1.0971 2.8868 10.3243 21.2697 12.8082 680.4395 68.3014 38.1589 45.3831 24.3288 28.1580 4.5668
temp: 298.150 k
press: 1.00000 atm
elementType: 8 8 8 8 8 8 8 8 8 7 7 6 6 6 6 6 6 6 6 6 6 6 6 6 6 6 6 6 6 1 1 1 1 1 1 1 1 1 1 1 1 1 1 1 1 1 1 1 1 1 1 1 1
symmnumber: 1
zpe: 1088529.2 jmol-1
zpe.correction: 0.414599 hartree
zpe.thermalcorrener: 0.443971 hartree
zpe.thermalcorrenthalpy: 0.444915 hartree
zpe.thermalcorrgfe: 0.352223 hartree
zpe.sumelectzpe: -1484.622773 hartree
zpe.sumelectthermal: -1484.593401 hartree
zpe.sumelectthermalent: -1484.592457 hartree
zpe.sumelectthermalfe: -1484.685149 hartree
dipole: 4.8416 4.1050 -1.5810
dipole: 6.5415
quadrupole: -173.2518 -184.4843 -169.8269
quadrupole: 17.7749 -10.6017 6.1225
quadrupole: 2.6025 -8.6299 6.0274 17.7749 -10.6017 6.1225
hfenergy: -1485.0373717 hartree
pointgroup: C01 [X(C18H24N2O9)]
dipole: -1.8900817 0.1987715 1.7354097 debye
polarizability: 260.0564404|19.3379344|206.290693|1.5145425|31.1264771|244.3552229 unknown
InChI: InChI=1S/C18H24N2O9/c1-2-18(16(26)27,9-6-4-3-5-7-9)15(25)20-17(28)19-14-13(24)12(23)11(22)10(8-21)29-14/h3-7,10-14,19-24,26H,2,8H2,1H3
charge 0 multiplicity 1
53 atoms
O  3.323011 0.54844 0.983247
O  5.663961 -0.223213 -2.418729
O  6.919323 0.630759 0.005161
O  3.2277 -1.64119 -2.101676
O  4.482508 1.39192 3.460086
O  0.635475 -1.674555 -1.541695
O  -2.042202 -0.680322 -2.271244
O  -5.739429 -0.316896 -0.949906
O  -4.259491 1.269911 -1.750804
N  1.361229 -0.201021 0.125947
N  -0.927446 -0.505754 -0.208628
C  5.002309 -0.425977 -1.129202
C  5.473918 0.698476 -0.204514
C  3.473388 -0.45313 -1.298523
C  4.802088 0.519631 1.168231
C  2.803435 -0.513868 0.107729
C  5.10794 1.641657 2.159279
C  -3.415312 -0.497463 -0.216401
C  0.392109 -0.843814 -0.616025
C  -3.809077 -1.988707 0.065897
C  -2.076941 -0.539871 -1.031167
C  -3.280333 0.343624 1.086301
C  -4.46413 0.24132 -1.075587
C  -3.930709 -2.897903 -1.173998
C  -2.905787 1.714593 0.988671
C  -3.507447 -0.205939 2.373885
C  -2.758107 2.506329 2.146473
C  -3.358521 0.589807 3.534203
C  -2.982075 1.946505 3.426953
H  5.312178 -1.403725 -0.697071
H  5.186212 1.67713 -0.646412
H  3.128346 0.472881 -1.807669
H  5.093694 -0.458115 1.605647
H  2.992173 -1.519289 0.548828
H  4.776598 2.611649 1.730951
H  6.192636 1.677657 2.339724
H  1.125091 0.59612 0.723503
H  5.290339 -0.895302 -3.046718
H  7.336176 0.511981 -0.888092
H  2.229045 -1.799034 -2.135595
H  -3.051347 -2.413476 0.753495
H  -4.776248 -1.979102 0.599604
H  -1.075718 -0.203978 0.759814
H  3.514518 1.247501 3.299846
H  -4.68723 -2.515243 -1.879248
H  -2.977506 -2.996333 -1.719365
H  -4.247011 -3.907417 -0.854518
H  -2.75329 2.161402 -0.000831
H  -3.808468 -1.250708 2.485924
H  -2.475606 3.560294 2.049459
H  -3.54168 0.147085 4.519392
H  -2.870531 2.561693 4.326367
H  -6.38336 0.237977 -1.468996
