program: Gaussian 09
title: 000180041
version: EM64L-G09RevD.01
frameworkgroup: C1[X(C10H14O2)]
method: RPBEPBE
basis: SDD
operation: Freq
keyword: #pfreq=noraman
keyword: PBEPBE/SDD
title: #p freq=noraman PBEPBE/SDD
converged: YES YES NO NO
title: Mulliken charges:
elementType: O O C C C C C C C C C C H H H H H H H H H H H H H H
charge: -0.220207 -0.189941 -0.556109 -0.326075 0.431410 -0.204445 0.382297 -0.620790 -0.803682 -0.809136 -0.216253 -0.025727 0.221198 0.222355 0.221519 0.235486 0.244065 0.274652 0.225015 0.228652 0.224454 0.286118 0.215016 0.213245 0.173168 0.173716
chargesum: 0.00000
title: Mulliken charges with hydrogens summed into heavy atoms:
elementType: O O C C C C C C C C C C
charge: -0.220207 -0.189941 -0.112556 -0.104556 0.431410 0.031040 0.382297 -0.102072 -0.125561 -0.094758 -0.043086 0.147989
polarizability: 1.48489714e+02 -3.36804437e+00 9.97913112e+01 7.11750485e+00 7.15466912e+00 1.01398978e+02
1716.lowfreq: -7.6966 -0.0005 -0.0002 0.0002 3.6311 10.4376 24.8634 43.4234 60.1128
frequency: 24.5074 42.9399 60.0952 79.8375 108.8965 121.3705 154.9882 183.4404 189.5830 197.7694 235.8808 271.7648 293.7454 341.1066 394.0872 436.4661 445.0676 489.9183 542.3802 607.8309 680.9249 731.7088 765.7508 800.4285 833.5321 878.3046 935.1257 956.9553 958.2147 973.7697 987.1726 991.4033 1009.8869 1082.4112 1085.1659 1105.6151 1149.8757 1191.4482 1220.1029 1246.9080 1276.0766 1298.3870 1348.7756 1358.0044 1381.8125 1390.3053 1393.9444 1405.5206 1416.7647 1456.1867 1457.8219 1466.8939 1475.2141 1483.3449 1579.4873 1634.3698 1649.7453 1675.9993 2871.4617 2922.4087 2962.2296 2969.4882 2972.5702 2988.9310 3023.7980 3036.8170 3050.7432 3052.8684 3079.5398 3081.7382 3084.1534 3108.2573
redmass: 5.6772 4.2000 4.2827 2.9923 3.0863 3.9914 1.1245 1.4878 1.8824 3.4610 2.5782 2.7486 2.0219 3.0736 2.4688 3.8677 2.4605 2.3980 2.8736 3.1223 2.4960 1.8677 2.9877 2.3192 1.8970 1.7014 2.3745 1.7939 1.4310 1.7592 1.6398 1.3418 2.1706 2.9322 1.7307 1.8936 1.4819 1.2663 2.0681 1.5616 1.4110 1.7116 1.4995 1.3132 1.1921 1.2533 1.5313 1.2166 1.1923 1.0733 1.0621 1.0617 1.0612 1.0645 7.5977 6.7752 7.4732 6.3002 1.0851 1.0851 1.0369 1.0390 1.0610 1.0625 1.0978 1.0967 1.0960 1.0948 1.0989 1.0908 1.0982 1.0911
irintensity: 2.3164 0.6437 1.8112 1.4135 4.9833 2.3962 1.6088 6.6876 4.3917 6.8077 6.0574 12.8104 2.0676 6.6424 1.9567 2.6617 8.4716 6.5747 1.0847 1.7350 13.6174 20.1493 0.7629 14.8502 18.2146 4.6853 33.2276 2.8350 2.2999 1.8207 3.5009 5.5877 1.0403 1.9506 6.4236 8.6124 17.8101 7.9197 2.7069 7.9006 14.7498 38.4164 1.9872 35.7706 12.1105 16.1648 8.6773 11.8759 40.7263 2.0902 9.7220 17.2274 23.7548 26.4803 191.3246 112.7253 59.9876 18.8395 168.6304 78.4770 32.2342 23.2642 31.6048 26.6302 0.9454 22.1594 10.3830 8.0889 23.3339 25.2778 30.8431 43.2714
temp: 298.150 k
press: 1.00000 atm
elementType: 8 8 6 6 6 6 6 6 6 6 6 6 1 1 1 1 1 1 1 1 1 1 1 1 1 1
symmnumber: 1
zpe: 557220.8 jmol-1
zpe.correction: 0.212234 hartree
zpe.thermalcorrener: 0.226439 hartree
zpe.thermalcorrenthalpy: 0.227383 hartree
zpe.thermalcorrgfe: 0.169909 hartree
zpe.sumelectzpe: -538.928077 hartree
zpe.sumelectthermal: -538.913872 hartree
zpe.sumelectthermalent: -538.912928 hartree
zpe.sumelectthermalfe: -538.970403 hartree
dipole: -1.5904 -0.5693 -3.4412
dipole: 3.8335
quadrupole: -72.8896 -74.4831 -71.3947
quadrupole: 4.9361 -9.5400 0.0123
quadrupole: 0.0328 -1.5606 1.5278 4.9361 -9.5400 0.0123
hfenergy: -539.1403113 hartree
pointgroup: C01 [X(C10H14O2)]
dipole: -0.5380802 0.4064341 1.3490573 debye
dipolederiv: -0.8871797 -0.001025 0.3744411 0.1246873 -0.3713292 -0.0351361 0.3926433 0.086655 -0.7047642 -0.6219065 -0.2045524 -0.1997538 -0.0679894 -0.6013892 -0.0560084 -0.1809141 -0.1236198 -0.3467286 -0.2096542 0.0392898 0.075401 -0.0593751 0.093471 0.0567368 0.1120346 -0.004552 0.0915288 -0.078171 0.1002753 -0.115336 0.0981024 -0.2828365 0.0153351 -0.4005364 0.0357859 -0.0776813 0.1337646 0.095103 -0.1352355 0.3390621 0.2163745 0.1507738 0.001464 0.1678315 0.126876 0.6200529 -0.0645604 -0.3136685 -0.3271188 -0.1003117 -0.0266775 -0.095428 -0.0942379 0.1815691 -0.3491303 -0.1931953 0.2256161 -0.1210137 0.0325845 0.0429758 0.581494 0.0148029 -0.5213041 -0.0013538 -0.1506672 -0.0270568 0.0078661 -0.4502633 -0.0360271 -0.0211165 -0.0586708 0.0524661 -0.0525272 -0.0816824 0.0524926 -0.1947681 -0.0111659 0.0111073 0.0022034 -0.0221612 0.0483567 -0.072422 0.0856276 0.1426746 0.0237805 -0.0601611 -0.0729888 0.1132272 -0.0154187 -0.0437459 0.8147036 -0.1079494 -0.3362939 -0.0616835 0.2806141 -0.2211528 -0.7390941 -0.2038701 0.9919989 0.6758273 0.1485273 0.3120187 0.0080027 1.0840288 0.0918093 0.2754278 0.1266821 0.2228435 0.0363476 0.0332027 0.017024 0.0274869 -0.0699263 -0.0989311 -0.0255288 -0.1173997 0.0341918 0.0247376 -0.0473274 0.0271538 -0.0362274 0.0621545 0.0259439 -0.0016708 0.1107552 -0.0899334 -0.0502696 -0.0276251 0.1163355 -0.0364622 0.0923447 -0.0699952 0.1427807 -0.0825602 -0.0381099 0.0722388 0.0232608 0.0225382 0.0166286 0.0567195 0.0956895 -0.0260283 0.0714843 -0.0680035 0.1090408 0.0628056 0.018072 0.0139944 0.0562521 0.002043 -0.0757139 0.0264666 -0.0760392 -0.0119797 0.0624914 0.0053269 -0.0097226 0.0878299 -0.0090538 0.1025182 -0.0067885 0.1385997 0.0262127 -0.0033572 0.0744722 0.0604699 0.0625852 -0.0968047 0.1404989 -0.048655 -0.0815409 0.0338226 0.0480188 -0.0118065 -0.024276 -0.146239 0.0231948 0.0355342 0.0303355 0.1075019 -0.0705713 -0.0479691 -0.0963558 -0.0026724 0.091992 0.0169073 -0.1473004 0.0094395 -0.0535378 0.1187078 0.0566754 0.0293629 0.0494894 0.0336095 0.0068911 0.0118439 0.0075601 0.0543745 -0.040769 -0.0705817 -0.139536 -0.0642999 0.0751424 -0.0661541 -0.0987618 -0.0858465 -0.0342474 0.0180196 -0.0909259 0.0860398 -0.0867784 -0.0415088 0.0876186 0.0805072 0.0257286 0.0320826 -0.0705936 0.1617922 -0.0980593 0.1408396 -0.0322783 0.0986706 -0.0699437 0.0738557 0.0103007 -0.1669479 0.1743485 -0.1058673 0.1819778 -0.1582934 0.0632328 -0.1101407 0.0763974 0.042946 unknown
polarizability: 147.6395849|1.3539035|101.4218818|-9.9256185|7.3143873|100.6185365 unknown
InChI: InChI=1S/C10H14O2/c1-9(2)4-3-5-10(8-12)6-7-11/h4-5,7-8H,3,6H2,1-2H3
charge 0 multiplicity 1
26 atoms
O  2.501535 0.683448 -1.751974
O  0.780692 -2.384849 0.074725
C  -1.114416 1.712506 0.523396
C  -2.403865 0.908192 0.706953
C  -2.804635 -0.129438 -0.085967
C  0.063577 0.866739 0.97078
C  1.184848 0.49806 0.266672
C  2.189801 -0.487175 0.829057
C  -4.075431 -0.899527 0.225729
C  -2.022173 -0.613914 -1.294292
C  1.459551 0.987676 -1.099937
C  1.840118 -1.956215 0.585208
H  -1.167906 2.620387 1.155851
H  -1.004285 2.058445 -0.518966
H  -3.016006 1.169301 1.581241
H  -0.052239 0.458058 1.987253
H  2.324554 -0.368492 1.924151
H  3.18556 -0.320376 0.369264
H  -4.566082 -0.536321 1.145476
H  -3.855091 -1.977966 0.353075
H  -4.800095 -0.822322 -0.608646
H  -1.311344 -1.413384 -1.003074
H  -2.700678 -1.030327 -2.060922
H  -1.427782 0.188147 -1.765239
H  0.701441 1.669794 -1.549358
H  2.639146 -2.667747 0.919543
