program: Gaussian 09
title: 000180026
version: EM64L-G09RevD.01
frameworkgroup: C1[X(C5H8N4O2)]
method: RPBEPBE
basis: SDD
operation: Freq
keyword: #pfreq=noraman
keyword: PBEPBE/SDD
title: #p freq=noraman PBEPBE/SDD
converged: YES YES NO NO
title: Mulliken charges:
elementType: O O N N N N C C C C C H H H H H H H H
charge: -0.208191 -0.445757 -0.087470 -0.181689 -0.051510 -0.577089 0.065735 -0.345139 0.061488 0.041451 -0.503013 0.227708 0.227628 0.347497 0.340677 0.241850 0.241834 0.235945 0.368046
chargesum: 0.00000
title: Mulliken charges with hydrogens summed into heavy atoms:
elementType: O O N N N N C C C C C
charge: -0.208191 -0.077711 -0.087470 -0.181689 -0.051510 0.111085 0.065735 0.110197 0.061488 0.041451 0.216615
polarizability: 1.16736610e+02 -9.81075556e+00 1.10974466e+02 -5.13630291e-03 -1.48449563e-02 4.64971828e+01
1716.lowfreq: -9.8045 -0.0007 -0.0005 0.0005 5.3428 7.3688 72.6760 104.6176 132.3324
frequency: 72.6704 104.6175 132.3307 161.7380 176.0637 187.3762 218.5823 224.5489 350.8505 407.1644 449.2365 506.6975 528.8617 563.4217 570.1468 581.0703 594.8568 684.6920 713.8265 797.4895 884.1430 904.1956 957.9163 1016.6624 1019.9793 1042.7908 1106.6516 1112.6288 1151.6542 1182.2188 1236.6876 1272.4136 1332.0095 1347.5652 1405.6841 1440.5505 1451.4743 1452.3801 1460.8927 1479.9029 1491.8099 1535.0301 1623.0431 2973.9747 3008.4268 3012.8782 3113.6990 3149.7488 3383.5089 3550.7675 3708.3546
redmass: 3.8061 2.9431 1.1712 4.5259 3.4873 5.5700 3.7451 5.9561 3.1997 5.3838 1.1291 5.9727 1.1822 1.0627 5.6329 7.8929 3.3766 4.5396 11.5006 9.9326 6.9151 12.4856 4.4661 1.9298 3.7671 6.6274 2.5948 1.2524 1.5259 1.0692 2.9190 1.8963 3.3911 3.7700 1.6457 1.4780 1.0510 1.5144 1.0679 2.3989 3.0840 2.9602 1.8691 1.0578 1.0291 1.1030 1.1048 1.1053 1.0644 1.0448 1.1058
irintensity: 6.1987 15.0407 3.7229 6.6484 3.7533 0.1393 2.9913 0.0336 9.6713 19.8701 52.6083 4.2995 329.9150 33.9298 9.7534 7.7030 0.8549 1.1317 0.2329 34.1535 18.2149 9.4509 76.3660 1.3386 83.5435 16.3030 17.3894 0.1124 18.9971 2.0552 11.9565 202.5834 152.3116 165.8632 184.0432 46.6317 14.9246 189.7981 65.7042 134.1696 212.7759 331.6843 473.6456 33.6687 38.6625 23.5706 25.0820 20.9109 66.0226 126.5276 56.4149
temp: 298.150 k
press: 1.00000 atm
elementType: 8 8 7 7 7 7 6 6 6 6 6 1 1 1 1 1 1 1 1
symmnumber: 1
zpe: 375842.1 jmol-1
zpe.correction: 0.143151 hartree
zpe.thermalcorrener: 0.153813 hartree
zpe.thermalcorrenthalpy: 0.154757 hartree
zpe.thermalcorrgfe: 0.106794 hartree
zpe.sumelectzpe: -563.947383 hartree
zpe.sumelectthermal: -563.936721 hartree
zpe.sumelectthermalent: -563.935776 hartree
zpe.sumelectthermalfe: -563.983740 hartree
dipole: 1.3453 1.7440 0.0042
dipole: 2.2026
quadrupole: -69.6871 -53.8364 -64.5974
quadrupole: -18.6248 -0.0072 -0.0123
quadrupole: -6.9801 8.8706 -1.8904 -18.6248 -0.0072 -0.0123
hfenergy: -564.0905334 hartree
pointgroup: C01 [X(C5H8N4O2)]
dipole: 0.5951849 0.6193903 -0.114252 debye
dipolederiv: -1.5573516 0.6401013 -0.1009833 0.3978279 -0.5903323 0.0427894 -0.0573745 0.0401785 -0.3324159 -0.7682748 0.0548717 -0.007917 0.0750786 -0.4035394 -0.0236265 -0.0117678 -0.0238855 -0.5299273 -1.4785967 -0.0345515 0.0199366 -0.3337129 -0.6361859 0.0875604 0.0728598 0.0841025 -0.1791212 -0.6777704 -0.2229663 0.0446351 0.0261653 -1.3485235 0.2059025 0.0007231 0.2085921 -0.2252396 -1.0125806 0.6255087 -0.1031175 0.4262968 -1.0661285 0.1419551 -0.0677665 0.1401986 -0.265868 -0.328875 0.3955951 -0.0742548 0.4225987 -1.4166285 0.1233475 -0.0789555 0.1233685 -0.7188555 1.0129646 0.0258558 -0.015051 0.1020812 1.0135857 -0.1720195 -0.0292071 -0.1717084 0.081833 0.4225355 -0.2408054 0.0427855 -0.4638778 0.0299254 0.056063 0.0831403 0.0548683 0.3110574 2.0744808 -0.6104333 0.0894279 -0.126904 1.0806778 -0.1466101 0.0031851 -0.1414236 0.2731835 0.9354613 -0.4788704 0.0777575 -0.4081066 1.944749 -0.2995747 0.0649971 -0.2988357 0.2875056 0.5095752 -0.2050694 0.0339058 -0.4249548 0.5449916 -0.0452762 0.073053 -0.0476194 0.2726196 -0.0065965 0.0362774 0.0280635 0.0604656 -0.0116513 -0.0901592 0.0411825 -0.1270885 -0.0103985 -0.0085226 0.0257609 -0.0399362 0.0434824 0.0589499 0.0637544 -0.0607136 0.1009623 -0.0801472 0.1632804 0.0390484 -0.0045412 -0.010846 0.300068 0.0158528 0.0043043 0.0153656 0.385924 0.2148389 -0.0876373 0.0174015 -0.0429747 0.2524287 0.0247712 0.0094547 0.0252436 0.3847439 0.0782921 -0.0503303 -0.0738802 0.0771981 -0.051037 -0.0595233 -0.0557182 -0.0822776 -0.0276455 0.080747 -0.0206634 0.0838123 0.0922884 -0.002633 0.0480685 0.0228484 0.0733471 -0.0784192 -0.154192 0.0407775 -0.004405 -0.0211677 0.0814652 0.0081187 0.0066034 0.0074898 0.1246469 0.5005844 0.0675306 -0.0136396 0.1090616 0.2198181 0.0186061 -0.0208486 0.0191219 0.326524 unknown
polarizability: 114.7210729|-10.1500861|110.9822118|1.1073865|-11.3588974|48.5049745 unknown
InChI: InChI=1S/C5H8N4O2/c1-11-5-8-3(2-10)7-4(6)9-5/h10H,2,6H2,1H3
charge 0 multiplicity 1
19 atoms
O  2.5806 -0.263267 0.040492
O  -3.346497 -1.261133 0.275717
N  0.368426 -1.070146 0.207037
N  -1.427929 0.533073 -0.058889
N  0.891636 1.272893 -0.214673
N  -0.879237 2.782596 -0.464515
C  -0.951321 -0.721114 0.158995
C  -2.001669 -1.796792 0.361158
C  1.232593 -0.023684 0.012408
C  -0.458474 1.503582 -0.24182
C  3.014138 -1.659843 0.284341
H  -1.854348 -2.583059 -0.406488
H  -1.839203 -2.266738 1.35215
H  -0.1839 3.5128 -0.601691
H  -1.875114 2.986831 -0.490282
H  2.631773 -2.326396 -0.505974
H  2.649591 -2.011981 1.26325
H  4.111514 -1.604173 0.263388
H  -3.238178 -0.281047 0.099995
