program: Gaussian 09
title: 000180013
version: EM64L-G09RevD.01
frameworkgroup: C1[X(C14H10Cl4)]
method: RPBEPBE
basis: SDD
operation: Freq
keyword: #p
keyword: freq=noraman
keyword: PBEPBE/SDD
title: #p freq=noraman PBEPBE/SDD
converged: YES YES NO NO
title: Mulliken charges:
elementType: Cl Cl Cl Cl C C C C C C C C C C C C C C H H H H H H H H H H
charge: -0.015248 -0.007586 -0.014194 -0.008108 -0.711873 0.625914 0.565998 -0.360060 -0.382352 0.525223 -0.283357 -0.420535 -0.342112 -0.471325 -0.793505 -0.069808 -0.187864 -0.123400 0.233470 0.258953 0.244550 0.240867 0.272192 0.241769 0.249060 0.250114 0.224499 0.258718
chargesum: 0.00000
title: Mulliken charges with hydrogens summed into heavy atoms:
elementType: Cl Cl Cl Cl C C C C C C C C C C C C C C
charge: -0.015248 -0.007586 -0.014194 -0.008108 -0.219450 0.625914 0.565998 -0.360060 -0.137802 0.525223 -0.283357 -0.179668 -0.069921 -0.229555 -0.069832 -0.069808 0.070854 -0.123400
polarizability: 2.43940128e+02 2.12531764e+01 1.68053845e+02 -2.67760716e+00 -3.28226606e+00 1.50407997e+02
1716.lowfreq: -4.8343 -3.8967 -2.8513 0.0024 0.0025 0.0025 4.2995 13.9532 30.8745
frequency: -4.2107 13.8728 30.8638 75.8905 97.6646 118.9602 129.2237 159.2816 179.1731 185.0621 207.3030 237.3411 257.6129 273.8939 295.1139 315.5665 346.6709 376.2556 413.7677 432.3875 439.1570 448.7800 480.2946 506.2040 517.4719 554.7051 583.2520 651.5402 670.8784 699.6243 712.3855 740.5907 786.9923 815.8367 831.1502 858.6668 886.3204 895.4043 942.0179 956.6576 964.0377 1003.7426 1007.2751 1047.1968 1064.7095 1118.8763 1141.7404 1160.6476 1189.0896 1202.9373 1239.2412 1255.1242 1261.4649 1302.5770 1358.6549 1369.8552 1370.8461 1389.7010 1402.1894 1456.9162 1459.9165 1464.6109 1467.9144 1471.6607 1552.5412 1570.6330 1595.2188 1608.8275 2987.4865 2999.7182 3052.8131 3067.7333 3098.3458 3131.6934 3136.7651 3154.6153 3158.6401 3170.5856
redmass: 10.7247 9.5103 8.4334 11.1703 6.6018 2.7127 1.2260 7.0374 8.5833 17.5978 24.8613 6.0534 4.3858 3.8773 5.7464 3.4062 9.8246 5.8544 6.2331 7.2890 3.3148 5.1658 3.6603 4.4935 5.2276 4.4696 5.7875 5.9179 6.2566 3.8021 6.4429 5.0619 3.1280 1.4467 1.7151 2.4506 2.1468 2.9125 1.6961 1.4710 1.4723 5.1438 1.5624 1.5280 4.5156 1.9544 1.6568 1.3520 1.1384 2.5060 4.3925 1.4401 1.6685 1.8255 4.0985 4.9715 5.6084 2.5145 1.2239 2.1464 1.0457 2.5173 1.2066 1.3100 5.2620 7.5576 6.6656 7.5734 1.0369 1.0607 1.0995 1.0973 1.0998 1.0876 1.0898 1.0971 1.0922 1.0956
irintensity: 0.7133 0.0610 0.4098 0.0040 0.5376 0.6896 0.1888 0.5937 0.3392 0.0335 0.0633 3.8725 0.4185 3.0299 0.6915 1.1056 2.4238 0.6863 5.3902 9.2012 7.9886 5.3679 3.8579 4.3555 5.8840 5.2805 7.8004 8.8378 12.7418 1.2442 15.0705 19.5123 6.1355 49.3493 23.4517 15.2609 17.9150 8.1450 24.9830 6.3406 6.3083 49.0899 9.6625 8.0475 24.9831 31.2071 10.7434 0.6250 3.9838 10.3884 15.7879 2.6381 1.0947 4.1853 10.6446 12.6197 6.9714 20.0489 14.9310 86.7131 17.1471 53.5128 13.9260 13.0136 6.7512 11.0114 3.8287 4.9865 19.2777 17.2677 6.1814 11.4233 15.7598 7.5198 8.2154 12.8946 0.6885 3.7594
temp: 298.150 k
press: 1.00000 atm
elementType: 17 17 17 17 6 6 6 6 6 6 6 6 6 6 6 6 6 6 1 1 1 1 1 1 1 1 1 1
symmnumber: 1
zpe: 511884.3 jmol-1
zpe.correction: 0.194966 hartree
zpe.thermalcorrener: 0.211416 hartree
zpe.thermalcorrenthalpy: 0.212361 hartree
zpe.thermalcorrgfe: 0.148515 hartree
zpe.sumelectzpe: -2378.460602 hartree
zpe.sumelectthermal: -2378.444152 hartree
zpe.sumelectthermalent: -2378.443208 hartree
zpe.sumelectthermalfe: -2378.507053 hartree
dipole: 1.4586 -3.5984 1.9895
dipole: 4.3628
quadrupole: -140.6438 -126.5517 -128.6838
quadrupole: 7.7193 10.3031 0.0324
quadrupole: -8.6840 5.4081 3.2760 7.7193 10.3031 0.0324
hfenergy: -2378.6555682 hartree
pointgroup: C01 [X(C14H10Cl4)]
dipole: 0.747699 -1.5157344 -0.2996404 debye
polarizability: 238.4512219|29.4858708|171.5218004|-3.0532044|4.4694808|152.4289475 unknown
InChI: InChI=1S/C14H10Cl4/c1-8-2-4-10(14(18)13(8)17)6-9-3-5-11(15)12(16)7-9/h2-5,7H,6H2,1H3
charge 0 multiplicity 1
28 atoms
Cl 1.655494 1.987189 -2.103536
Cl 4.317576 2.158537 -0.306608
Cl -2.970371 1.6977 2.060076
Cl -5.352941 -0.49485 1.457124
C  -0.060197 -0.653093 -1.731793
C  1.204078 -0.50355 -0.892772
C  -1.354605 -0.622941 -0.918586
C  2.06446 0.619619 -0.968914
C  1.564211 -1.528266 0.01872
C  3.592346 -0.321787 0.731424
C  3.233037 0.705472 -0.176518
C  2.724518 -1.440797 0.808785
C  -1.558166 0.364173 0.077359
C  -2.388392 -1.558508 -1.168508
C  4.840925 -0.237264 1.584061
C  -2.766272 0.412072 0.798696
C  -3.600133 -1.511358 -0.446037
C  -3.790753 -0.524223 0.541362
H  -0.011859 -1.610054 -2.284801
H  -0.093942 0.147995 -2.492263
H  0.910341 -2.403326 0.105235
H  2.974097 -2.250786 1.502532
H  -0.776844 1.098025 0.297917
H  -2.253274 -2.330766 -1.934157
H  5.748519 -0.150884 0.959327
H  4.821215 0.653391 2.238214
H  4.938667 -1.133084 2.219056
H  -4.397135 -2.234837 -0.640491
