program: Gaussian 09
title: 000180012
version: EM64L-G09RevD.01
frameworkgroup: C1[X(C14H10Cl4)]
method: RPBEPBE
basis: SDD
operation: Freq
keyword: #p
keyword: freq=noraman
keyword: PBEPBE/SDD
title: #p freq=noraman PBEPBE/SDD
converged: YES YES NO NO
title: Mulliken charges:
elementType: Cl Cl Cl Cl C C C C C C C C C C C C C C H H H H H H H H H H
charge: -0.064348 -0.047440 -0.059434 -0.049259 -0.747240 0.667033 0.659519 -0.374082 -0.357546 0.550870 -0.311550 -0.409043 -0.370400 -0.335181 -0.793555 -0.110204 -0.201364 -0.229726 0.256886 0.256124 0.277201 0.264130 0.278300 0.226183 0.248911 0.249551 0.261900 0.263761
chargesum: 0.00000
title: Mulliken charges with hydrogens summed into heavy atoms:
elementType: Cl Cl Cl Cl C C C C C C C C C C C C C C
charge: -0.064348 -0.047440 -0.059434 -0.049259 -0.234229 0.667033 0.659519 -0.374082 -0.080344 0.550870 -0.311550 -0.144913 -0.370400 -0.056880 -0.068911 -0.110204 0.060536 0.034035
polarizability: 2.12292374e+02 -1.52306678e+01 2.15123307e+02 1.32923225e+00 -6.33794362e-01 1.28972861e+02
1716.lowfreq: -2.7214 -0.0017 -0.0009 0.0013 5.0856 6.4401 14.0231 31.1114 39.6695
frequency: 13.9918 31.1073 39.6653 75.7367 90.7557 122.2106 132.1717 140.0734 168.6751 204.8701 215.1753 239.4310 250.2130 298.5598 307.8327 308.8155 322.3313 347.8958 414.3605 431.9111 442.1851 474.2767 487.6649 496.4817 503.8345 547.7039 569.0766 630.3781 676.7295 692.7679 700.6746 726.4937 786.5177 809.7512 855.5505 870.8563 895.0118 904.6512 917.2545 932.2291 945.9441 1004.2616 1012.5615 1043.7918 1045.7926 1083.4946 1126.2785 1160.9903 1190.6868 1200.5878 1239.1085 1260.1533 1270.5083 1312.6624 1348.5217 1370.4751 1372.1420 1383.8260 1402.7296 1449.8121 1460.5487 1467.3202 1470.1864 1478.5189 1551.5587 1564.3832 1596.2986 1610.2746 2987.9205 3025.9999 3067.8828 3084.8119 3099.8225 3157.7449 3159.1603 3162.4541 3164.0245 3183.3737
redmass: 19.6442 9.3506 6.0118 9.2943 10.0350 1.1519 9.9246 4.4914 8.1129 7.6129 5.3830 4.8939 4.5951 7.2481 21.1040 24.0938 3.2707 6.5629 3.2221 3.5913 2.9944 4.3267 5.2726 5.4264 4.5198 5.7656 5.6403 5.6439 5.8812 6.9705 3.9366 4.8871 3.8747 1.3611 4.1876 1.3808 1.3808 2.5687 2.7181 1.8541 1.3516 1.4663 6.0417 3.6302 1.5193 2.0053 1.6422 1.2960 1.6172 2.3861 5.6973 1.2484 1.2650 1.3968 3.8412 7.7003 7.4848 3.3845 1.2339 2.4280 1.0447 1.4903 1.4242 1.4090 5.7361 6.5363 8.1581 8.4277 1.0370 1.0597 1.0973 1.1019 1.0999 1.0931 1.0923 1.0928 1.0890 1.0980
irintensity: 0.0010 0.0797 0.2928 1.0731 1.0129 0.6276 0.0233 0.1233 0.0398 3.8335 1.9185 0.3187 0.9974 0.6430 0.0699 0.1162 3.5316 0.8350 4.5684 4.5615 8.6154 2.5336 24.5127 21.0650 31.5093 2.5955 0.8970 1.5265 0.8973 2.4479 0.5341 8.6408 13.8437 39.9207 19.8525 7.7701 16.1756 17.7002 6.0439 22.1666 0.6179 20.1580 76.9303 110.0072 9.7666 33.5172 3.7091 0.8351 3.1448 7.1177 0.2028 4.4736 2.0348 5.5621 25.4847 9.5117 2.3952 12.7915 13.7667 92.9460 15.3757 25.0800 68.0203 12.5436 3.1972 8.6328 11.7834 0.5922 18.0080 9.2182 11.3584 3.0895 15.5911 0.6166 0.0475 2.2911 0.4209 1.7479
temp: 298.150 k
press: 1.00000 atm
elementType: 17 17 17 17 6 6 6 6 6 6 6 6 6 6 6 6 6 6 1 1 1 1 1 1 1 1 1 1
symmnumber: 1
zpe: 511956.8 jmol-1
zpe.correction: 0.194994 hartree
zpe.thermalcorrener: 0.212363 hartree
zpe.thermalcorrenthalpy: 0.213307 hartree
zpe.thermalcorrgfe: 0.146826 hartree
zpe.sumelectzpe: -2378.469421 hartree
zpe.sumelectthermal: -2378.452052 hartree
zpe.sumelectthermalent: -2378.451107 hartree
zpe.sumelectthermalfe: -2378.517589 hartree
dipole: -0.6901 -0.0350 -0.1687
dipole: 0.7113
quadrupole: -125.5145 -134.4456 -133.2652
quadrupole: 12.8267 0.5802 -0.4140
quadrupole: 5.5606 -3.3705 -2.1901 12.8267 0.5802 -0.4140
hfenergy: -2378.6644149 hartree
pointgroup: C01 [X(C14H10Cl4)]
dipole: -0.267739 -0.0474006 0.0661246 debye
polarizability: 205.7191542|13.0324246|221.6721789|-1.0734621|-1.8939102|128.9972089 unknown
InChI: InChI=1S/C14H10Cl4/c1-8-4-14(18)10(7-13(8)17)5-9-6-11(15)2-3-12(9)16/h2-4,6-7H,5H2,1H3
charge 0 multiplicity 1
28 atoms
Cl -1.193314 2.716867 -1.565927
Cl -3.199472 -2.71437 1.221101
Cl 1.970154 -2.798931 -1.108243
Cl 3.550861 2.845629 1.530518
C  0.407491 -0.057039 -1.642008
C  -0.925233 -0.013811 -0.896814
C  1.611641 -0.026381 -0.701864
C  -1.727271 1.144821 -0.783554
C  -1.417742 -1.184227 -0.260884
C  -3.441962 -0.002942 0.550123
C  -2.636633 -1.163187 0.435263
C  -2.950082 1.163922 -0.085962
C  2.384942 -1.167793 -0.380212
C  1.994167 1.201702 -0.096901
C  -4.755408 0.010939 1.301596
C  3.092833 1.250842 0.777005
C  3.489302 -1.120256 0.493744
C  3.854702 0.107389 1.086567
H  0.467903 0.805789 -2.326901
H  0.445991 -0.972632 -2.256103
H  -0.835247 -2.10874 -0.320194
H  -3.531034 2.089238 -0.032216
H  1.422167 2.107741 -0.319825
H  -5.220983 1.009425 1.265523
H  -5.465393 -0.72104 0.875391
H  -4.610723 -0.26888 2.361022
H  4.059763 -2.027369 0.711145
H  4.708279 0.165194 1.767106
