program: Gaussian 09
title: 000180001
version: EM64L-G09RevD.01
frameworkgroup: C1[X(C12H4Br6)]
method: RPBEPBE
basis: SDD
operation: Freq
keyword: #pfreq=noraman
keyword: PBEPBE/SDD
title: #p freq=noraman PBEPBE/SDD
converged: NO YES NO NO
title: Mulliken charges:
elementType: Br Br Br Br Br Br C C C C C C C C C C C C H H H H
charge: 0.113612 0.056888 0.128447 0.084290 0.131483 0.031024 0.383149 0.351998 -0.370324 -0.307299 -0.383181 -0.267936 -0.116490 -0.156359 -0.187439 -0.207787 -0.164915 -0.193847 0.281497 0.272513 0.259821 0.260856
chargesum: 0.00000
title: Mulliken charges with hydrogens summed into heavy atoms:
elementType: Br Br Br Br Br Br C C C C C C C C C C C C
charge: 0.113612 0.056888 0.128447 0.084290 0.131483 0.031024 0.383149 0.351998 -0.370324 -0.025802 -0.383181 0.004577 -0.116490 -0.156359 -0.187439 -0.207787 0.094907 0.067009
polarizability: 3.10607490e+02 -4.72688161e+00 2.15548790e+02 -1.46052224e+01 -2.52164241e+00 1.78353044e+02
1716.lowfreq: -3.8575 -0.0003 0.0002 0.0003 0.8138 3.4032 9.3727 22.9103 41.4566
frequency: 9.2977 22.8898 41.4559 43.1928 49.4706 71.3854 88.6610 132.3806 140.8939 145.4269 153.8546 186.8258 203.1892 204.6995 213.0432 232.4319 239.6441 285.9559 301.8086 379.0736 416.1309 433.8423 445.7726 477.8234 514.1996 534.9515 599.3266 625.6049 642.6400 694.5025 714.7549 725.7835 742.3514 817.3231 824.0224 883.8569 891.4146 958.0790 980.8210 1012.1418 1070.5690 1089.5235 1136.8309 1155.5846 1233.8422 1254.8943 1298.7024 1320.6785 1348.2554 1356.3545 1392.3351 1448.4440 1502.4053 1548.7347 1554.9392 1587.7356 3162.0737 3164.6351 3173.7527 3180.9218
redmass: 45.9262 43.9384 21.3903 56.8503 37.0698 6.8806 58.4763 55.6677 41.4794 61.4308 10.9746 6.1268 56.0078 48.7325 42.0574 11.9190 6.4847 6.8446 8.3707 7.9974 4.5130 7.2120 8.3772 4.3472 11.5325 5.9622 5.3111 10.2548 7.8168 8.7825 5.4866 5.9658 7.0411 1.3344 9.2663 1.4487 1.4463 1.3465 9.4809 8.1279 3.9477 2.5480 1.5674 1.9770 2.5729 1.5127 3.8916 8.8100 6.5088 2.8912 3.8324 3.1124 10.2582 6.8012 7.6275 8.1665 1.0890 1.0930 1.0929 1.0978
irintensity: 0.0109 0.0059 0.0443 0.0095 0.0123 0.4272 0.0685 0.2696 0.0530 0.0355 0.1608 0.0153 0.0207 0.0345 0.1304 1.4326 2.3073 0.0721 0.2047 15.4415 0.6559 7.7152 9.5544 29.7514 18.2760 4.4605 1.6325 2.2111 3.6391 10.9987 6.3059 2.1210 24.4533 35.2106 27.7538 7.7538 6.8540 0.0228 73.8301 58.0933 35.2203 12.2397 16.2626 45.5234 28.1856 12.9364 59.6456 14.9486 8.7551 81.4826 109.1438 46.1637 28.5298 11.2200 0.8420 8.1904 0.3257 0.9325 0.3035 2.0674
temp: 298.150 k
press: 1.00000 atm
elementType: 35 35 35 35 35 35 6 6 6 6 6 6 6 6 6 6 6 6 1 1 1 1
symmnumber: 1
zpe: 305419.4 jmol-1
zpe.correction: 0.116328 hartree
zpe.thermalcorrener: 0.135044 hartree
zpe.thermalcorrenthalpy: 0.135988 hartree
zpe.thermalcorrgfe: 0.062086 hartree
zpe.sumelectzpe: -539.165883 hartree
zpe.sumelectthermal: -539.147167 hartree
zpe.sumelectthermalent: -539.146223 hartree
zpe.sumelectthermalfe: -539.220125 hartree
dipole: 1.7250 0.5360 0.5942
dipole: 1.9016
quadrupole: -150.8145 -158.0073 -158.8384
quadrupole: 0.1762 6.6828 0.4070
quadrupole: 5.0722 -2.1206 -2.9517 0.1762 6.6828 0.4070
hfenergy: -539.2822108 hartree
pointgroup: C01 [X(C12H4Br6)]
dipole: -0.6939652 -0.239775 0.1436755 debye
dipolederiv: -0.1696479 0.2898098 0.0168711 0.2987518 -0.4355541 -0.0280412 0.0121592 -0.0218885 0.0390822 -0.1974391 -0.014876 -0.2689257 -0.0121103 0.0020715 -0.0280393 -0.2454663 -0.02716 -0.5189659 -0.1463585 -0.295996 0.0156873 -0.3249412 -0.4062737 0.0266734 0.0158829 0.0255736 0.0431813 -0.1014623 0.217938 0.0135912 0.2936244 -0.5851423 -0.0338092 0.015932 -0.0316922 0.0180269 -0.6376545 0.0689201 0.0641475 0.0453969 0.0738023 -0.0035781 0.0658384 -0.0069071 0.0443256 -0.3312341 -0.0290132 -0.2946942 -0.0343544 -0.0211458 -0.0391147 -0.4144453 -0.0447624 -0.5165983 0.2351299 0.1514434 -0.0624134 0.1362744 -0.0775906 -0.0130796 -0.0892477 -0.015759 0.0230375 0.2876545 0.0543939 -0.233406 0.0606215 -0.0031364 -0.0161368 -0.0451002 -0.009639 -0.15628 0.0868188 -0.5453054 -0.0073313 -0.624792 0.5761368 0.0551639 0.0004709 0.0605363 -0.0897271 -0.1939745 0.0855102 0.0146872 0.0459092 -0.265401 -0.0147223 0.0114436 -0.0305815 -0.0582461 0.1365587 0.0121019 0.5739177 0.0036888 -0.1109313 0.079335 0.3734028 0.0439279 0.8763988 -0.3145204 -0.0243061 -0.0942412 -0.0207333 -0.060311 -0.0327037 -0.1874506 -0.022618 -0.2087737 -0.0392132 0.5835553 0.0026644 0.6763811 0.5590479 -0.0526569 0.0046812 -0.052344 -0.0432144 -0.0720114 -0.46807 -0.0035681 -0.3987369 1.016323 0.0501874 0.0082061 0.0635274 -0.0830781 0.9780621 -0.0711092 -0.092207 -0.1163858 -0.4511006 0.0046989 -0.1008056 0.0034506 -0.0614084 0.4893564 0.053611 0.598553 0.0494254 -0.1098326 0.0811963 0.7458913 0.0916799 0.9120786 -0.0704891 -0.0017462 -0.1072089 -0.01128 -0.0728704 -0.0092512 -0.1577147 -0.0007218 -0.178566 -0.0917935 -0.0216228 -0.2065443 -0.0089558 -0.0908858 -0.0143059 -0.1241704 -0.0176367 -0.2362533 0.0586485 -0.0407881 0.004325 -0.0627441 0.0239465 0.0060491 -0.000317 0.0041645 0.1292227 0.090499 0.0060271 0.0390324 0.0078869 0.1281009 -0.0041771 0.0769887 -0.0003241 0.0011136 0.0449241 -0.0037545 0.0302645 0.0019209 0.1515246 -0.0090085 0.0435753 -0.0068767 -0.0215367 -0.0418534 -0.0067233 -0.0032012 -0.0048476 0.1592225 -0.0046795 -0.0097547 -0.0039491 0.086181 unknown
polarizability: 307.9717196|-9.7443791|213.522096|21.9700288|8.4828996|183.0155083 unknown
InChI: InChI=1S/C12H4Br6/c13-5-1-2-8(14)6(3-5)7-4-9(15)11(17)12(18)10(7)16/h1-4H
charge 0 multiplicity 1
22 atoms
Br 0.06467 2.798074 0.043693
Br -0.905323 0.055978 3.052897
Br 3.450725 2.695239 -0.261152
Br 3.118657 -3.168048 -0.298322
Br 5.015689 -0.306087 -0.435953
Br -4.483957 -0.352183 -2.609303
C  0.244213 -0.09445 0.019705
C  -1.250034 -0.097054 0.140197
C  1.009017 1.099668 -0.045175
C  0.914749 -1.334971 -0.06367
C  -1.92352 -0.05104 1.387191
C  -2.031551 -0.192426 -1.041063
C  2.422719 1.049341 -0.17788
C  2.31467 -1.396219 -0.196701
C  3.086929 -0.209043 -0.253262
C  -3.436478 -0.22628 -0.95985
C  -3.3314 -0.084843 1.463487
C  -4.100785 -0.171498 0.2821
H  0.333365 -2.259239 -0.015485
H  -1.527965 -0.229869 -2.011323
H  -3.830902 -0.045803 2.435346
H  -5.192389 -0.197148 0.338723
