program: Gaussian 09
title: 000179983
version: EM64L-G09RevD.01
frameworkgroup: C1[X(C16H14ClF3N2O4)]
method: RPBEPBE
basis: SDD
operation: Freq
keyword: #p
keyword: freq=noraman
keyword: PBEPBE/SDD
title: #p freq=noraman PBEPBE/SDD
converged: YES YES NO NO
title: Mulliken charges:
elementType: Cl F F F O O O O N N C C C C C C C C C C C C C C C C H H H H H H H H H H H H H H
charge: -0.007053 -0.136260 -0.154670 -0.153138 -0.265016 -0.227663 -0.199745 -0.257882 -0.364396 -0.211160 0.538034 0.293533 0.204561 0.194777 -0.383623 -0.465332 0.367700 -0.329728 -0.627285 0.306223 0.037742 -0.313284 -0.192664 0.193588 -0.683578 -0.685154 0.293920 0.295012 0.259159 0.287227 0.261559 0.263995 0.236091 0.261040 0.214263 0.253001 0.225712 0.207621 0.235289 0.227585
chargesum: 0.00000
title: Mulliken charges with hydrogens summed into heavy atoms:
elementType: Cl F F F O O O O N N C C C C C C C C C C C C C C C C
charge: -0.007053 -0.136260 -0.154670 -0.153138 -0.265016 -0.227663 -0.199745 -0.257882 -0.364396 -0.211160 0.538034 0.293533 0.204561 0.194777 -0.089703 -0.170320 0.367700 -0.070569 0.185496 0.306223 0.273833 -0.313284 0.068376 0.193588 0.009399 -0.014659
polarizability: 3.21383457e+02 2.81630371e+00 1.98174164e+02 1.24319546e+01 6.68304836e+00 1.47616520e+02
1716.lowfreq: -4.0659 -0.0014 -0.0013 -0.0009 2.4634 5.4223 12.3215 20.8947 23.5333
frequency: 11.9176 20.8708 23.5208 39.5348 46.4007 54.1569 69.0002 77.7528 86.0431 108.7822 113.0261 132.4791 157.3913 162.8367 183.4061 192.2471 201.3343 213.9497 242.6624 248.6418 255.5823 271.4917 295.1498 306.5680 322.6843 351.6043 359.9606 387.5776 394.8071 414.3423 425.6310 437.2560 455.8163 460.1319 467.8717 477.0475 490.6209 529.0814 554.2944 606.0649 637.9806 648.1374 655.8275 669.2581 682.9400 700.5303 722.0608 735.4077 753.4116 779.5033 801.6728 827.3067 840.9530 853.6141 892.3631 923.0507 927.8729 937.2031 943.7860 960.4819 984.2778 1008.5108 1020.3944 1026.6022 1057.0267 1097.5893 1116.2715 1127.1938 1129.7605 1143.4183 1157.6094 1177.1144 1182.2421 1199.1117 1219.9045 1236.9692 1249.7865 1272.8448 1313.7926 1322.6883 1332.9938 1377.8315 1381.0095 1396.8537 1398.8510 1409.2266 1451.1771 1456.7489 1462.7510 1466.0448 1472.8272 1487.7504 1488.1285 1495.1787 1572.6842 1584.0424 1596.3289 1611.7846 1634.8519 1655.1281 2991.1466 2995.6822 3024.3939 3028.2253 3086.9025 3095.9435 3101.5027 3106.7443 3124.0943 3144.8804 3164.0571 3173.7980 3183.1236 3223.4355
redmass: 4.1076 5.7381 10.3808 8.5902 6.1501 4.3654 5.0751 4.8841 4.4223 2.9051 6.3261 5.6721 3.4998 2.9876 8.7368 1.0688 8.6688 2.2585 4.7293 1.6301 4.0563 6.5903 11.6339 8.7191 8.8484 6.2237 3.1101 4.5264 3.5303 5.7488 7.3438 4.3000 3.1398 6.7599 10.5431 15.6053 9.8673 5.0292 6.1375 6.7984 14.4044 8.1645 7.5388 5.6943 5.0018 4.8817 7.5317 6.7817 4.6775 4.1303 4.9112 1.6163 6.2838 1.5098 2.9584 3.7192 1.2103 1.7218 1.4258 1.3717 11.5401 3.2696 7.4014 5.7822 4.8130 1.7922 2.9365 1.2896 3.6019 1.7094 2.0324 4.8363 2.1422 2.9583 2.5523 2.3864 1.7824 1.8214 4.0240 1.5171 1.4029 8.4448 1.2603 1.7424 2.0410 1.9231 1.7425 1.0516 2.8050 1.0522 1.0515 1.1624 1.0508 1.0425 7.7842 9.9309 10.9096 7.1326 11.0769 8.8282 1.0357 1.0358 1.0331 1.0866 1.0991 1.0989 1.1010 1.1007 1.1038 1.1009 1.0890 1.0927 1.0980 1.0939
irintensity: 0.9171 0.2154 0.1058 0.3701 0.5648 1.5653 2.3429 0.3420 1.2181 0.4464 4.8754 0.4538 1.6401 1.0951 2.0411 0.1506 5.8526 2.8561 1.0026 0.8784 1.9370 7.0313 1.9349 1.3835 1.5664 1.8528 1.5391 9.6477 12.6371 10.1866 38.7432 0.0127 3.6082 8.0643 0.6893 2.6184 0.1165 18.2287 5.2113 13.5998 16.4698 0.3394 1.3235 3.5557 4.5515 4.9149 7.3649 4.9162 5.3323 22.6517 12.0598 18.3178 8.5366 60.2578 1.5883 82.5950 2.7785 13.9021 3.9288 1.8028 202.3637 144.3930 41.6807 40.5547 150.1867 225.2498 87.8806 1.2055 32.9800 47.7128 10.9751 156.5479 43.0626 218.1151 243.2438 43.1524 26.7614 84.3354 275.8986 13.5419 2.8001 5.9329 33.9150 87.9088 16.3359 13.5297 128.1714 7.2458 72.9390 5.8963 5.4290 86.8705 28.0397 17.7635 51.6379 157.9063 146.3239 39.4867 236.3231 213.5659 15.1108 22.9076 28.7541 6.2132 8.5834 50.2792 15.1227 28.9282 7.0548 1.3275 1.6883 5.2849 3.3082 10.6858
temp: 298.150 k
press: 1.00000 atm
elementType: 17 9 9 9 8 8 8 8 7 7 6 6 6 6 6 6 6 6 6 6 6 6 6 6 6 6 1 1 1 1 1 1 1 1 1 1 1 1 1 1
symmnumber: 1
zpe: 734280.6 jmol-1
zpe.correction: 0.279673 hartree
zpe.thermalcorrener: 0.305084 hartree
zpe.thermalcorrenthalpy: 0.306028 hartree
zpe.thermalcorrgfe: 0.220743 hartree
zpe.sumelectzpe: -1786.217122 hartree
zpe.sumelectthermal: -1786.191711 hartree
zpe.sumelectthermalent: -1786.190767 hartree
zpe.sumelectthermalfe: -1786.276052 hartree
dipole: 0.7828 1.4802 0.3401
dipole: 1.7087
quadrupole: -136.2178 -156.0581 -161.0515
quadrupole: 11.9180 2.4489 -4.1310
quadrupole: 14.8913 -4.9490 -9.9424 11.9180 2.4489 -4.1310
hfenergy: -1786.4967948 hartree
pointgroup: C01 [X(C16H14Cl1F3N2O4)]
dipole: -0.3156308 0.5912491 -0.0520862 debye
polarizability: 320.4568777|-2.8708953|198.8840106|17.9145643|1.5461038|147.833252 unknown
InChI: InChI=1S/C16H14ClF3N2O4/c1-8(2)26-14(24)10-6-9(4-5-11(10)17)22-13(23)7-12(16(18,19)20)21(3)15(22)25/h4-8H,1-3H3
charge 0 multiplicity 1
40 atoms
Cl 4.478018 2.198112 1.116108
F  -5.62123 -2.122467 0.50849
F  -6.248171 0.048277 0.434332
F  -5.682795 -1.045421 -1.477836
O  4.75905 -0.601016 0.267548
O  -1.725114 2.258951 -0.81154
O  -0.839899 -1.641778 1.679258
O  3.186422 -1.552269 -1.16353
N  -1.261106 0.315328 0.424505
N  -3.464602 0.720963 -0.483184
C  0.122364 0.743022 0.587578
C  -3.891252 -0.481329 0.084251
C  -2.115898 1.170863 -0.318981
C  -1.656622 -0.939012 1.02685
C  -3.056287 -1.291003 0.812026
C  1.157514 -0.072218 0.106034
C  2.521042 0.293115 0.267192
C  0.417397 1.961099 1.23645
C  -4.354667 1.599174 -1.291866
C  -5.33727 -0.895897 -0.109393
C  5.82201 -1.548662 -0.246761
C  2.801393 1.530635 0.90488
C  1.759437 2.355565 1.38176
C  3.503544 -0.695642 -0.297194
C  6.403441 -0.974072 -1.54614
C  6.83108 -1.661774 0.896814
H  -3.406908 -2.223168 1.253185
H  0.947001 -1.016343 -0.403881
H  -0.385909 2.604567 1.604959
H  -3.758152 2.47394 -1.584865
H  -5.220618 1.925342 -0.695248
H  -4.699556 1.06983 -2.193685
H  5.320588 -2.513734 -0.447396
H  2.005257 3.30658 1.861478
H  7.207104 -1.635393 -1.918518
H  5.628536 -0.902816 -2.327473
H  6.831015 0.028295 -1.368759
H  7.642103 -2.356534 0.613154
H  6.347488 -2.043402 1.811869
H  7.275052 -0.676608 1.121929
