program: Gaussian 09
title: 000179974
version: EM64L-G09RevD.01
frameworkgroup: C1[X(C6H6Br2N2O2)]
method: RPBEPBE
basis: SDD
operation: Freq
keyword: #p
keyword: freq=noraman
keyword: PBEPBE/SDD
title: #p freq=noraman PBEPBE/SDD
converged: NO YES NO NO
title: Mulliken charges:
elementType: Br Br O O N N C C C C C C H H H H H H
charge: 0.090897 0.064339 -0.257355 -0.283692 -0.139967 0.065687 0.328473 -0.160305 -0.650586 -0.328519 0.211459 -0.494795 0.257367 0.310431 0.257417 0.244608 0.244685 0.239857
chargesum: 0.00000
title: Mulliken charges with hydrogens summed into heavy atoms:
elementType: Br Br O O N N C C C C C C
charge: 0.090897 0.064339 -0.257355 -0.283692 -0.139967 0.065687 0.328473 -0.160305 0.174629 -0.328519 0.211459 0.234355
polarizability: 1.80536624e+02 -2.93183520e+00 1.27758757e+02 1.73979209e-02 -4.42741845e-02 5.09268373e+01
1716.lowfreq: -5.1631 -0.4531 -0.0002 0.0003 0.0005 4.5676 32.4680 62.1703 88.0477
frequency: 32.4606 62.1596 88.0415 107.2657 107.5831 134.1946 135.1201 144.7067 213.3865 244.8578 259.8599 295.8872 312.6521 333.2509 374.7367 486.8309 569.4729 622.7195 658.6669 711.8594 730.7295 752.1779 906.6860 948.3867 1081.0586 1096.8666 1111.4795 1129.2922 1149.1636 1212.2272 1244.6073 1322.0728 1331.7855 1368.0767 1414.8236 1450.2189 1451.9378 1461.1532 1465.6793 1475.8248 1493.5940 1606.4198 3004.6100 3008.2169 3098.1570 3111.3092 3136.0972 3155.2013
redmass: 5.2788 3.1868 1.1201 3.2681 5.6500 19.1645 1.3745 4.3327 6.4640 19.7790 5.8067 4.2127 9.6089 4.6977 7.8201 10.3690 5.6875 10.2803 12.0576 6.8587 11.6888 6.4197 9.0123 7.6232 2.7652 3.7763 1.2589 1.2999 1.4564 11.9235 5.1478 10.1459 4.7401 4.3030 1.5065 1.8191 1.0509 1.1805 1.6430 1.2249 1.0416 8.5234 1.0337 1.0295 1.1027 1.1048 1.1020 1.1049
irintensity: 1.5170 0.7059 0.9031 4.1726 0.6286 0.2922 3.0480 4.2794 1.1178 1.0332 1.8167 0.1966 1.4965 36.6519 1.7170 6.1287 1.8373 7.4579 0.2505 5.0054 5.2328 8.4717 1.2765 34.3740 238.1781 27.7564 0.0210 0.5197 48.1063 56.0848 271.1918 331.4634 21.9629 27.1856 2.6318 79.5763 14.9772 47.1055 131.5094 2.8056 19.4332 336.0600 34.1792 32.7940 12.6991 24.6368 8.6245 11.3587
temp: 298.150 k
press: 1.00000 atm
elementType: 35 35 8 8 7 7 6 6 6 6 6 6 1 1 1 1 1 1
symmnumber: 1
zpe: 308717.7 jmol-1
zpe.correction: 0.117584 hartree
zpe.thermalcorrener: 0.130653 hartree
zpe.thermalcorrenthalpy: 0.131598 hartree
zpe.thermalcorrgfe: 0.074922 hartree
zpe.sumelectzpe: -518.191008 hartree
zpe.sumelectthermal: -518.177939 hartree
zpe.sumelectthermalent: -518.176995 hartree
zpe.sumelectthermalfe: -518.233671 hartree
dipole: 0.5614 3.2783 0.0096
dipole: 3.3260
quadrupole: -71.0453 -92.7175 -87.5364
quadrupole: -2.7262 0.0337 0.0504
quadrupole: 12.7211 -8.9511 -3.7700 -2.7262 0.0337 0.0504
hfenergy: -518.3085928 hartree
pointgroup: C01 [X(C6H6Br2N2O2)]
dipole: 0.6235891 1.1474842 0.0822173 debye
dipolederiv: -0.5863386 0.1478825 0.0647695 0.2385583 -0.0633351 -0.0301467 0.0750155 -0.0232941 0.0352764 -0.1199777 0.281754 0.0427314 0.2316857 -0.4662056 -0.0723775 0.0372779 -0.0764068 0.0217578 -1.5413899 0.0723657 0.0988277 0.5775663 -0.4737813 -0.061981 0.1482581 -0.0236354 -0.2978064 -0.7763752 -0.2206787 0.0108328 -0.1078639 -1.0999253 -0.0712179 0.0212496 -0.0674792 -0.3348858 -0.1512117 0.1178468 0.0195805 0.0997764 -0.7779789 -0.0851556 0.0187306 -0.084861 -0.08016 -1.1746161 0.3997462 0.1209868 0.5647117 -0.7174949 -0.1034325 0.1395166 -0.0904642 -0.1911664 -0.9333281 -0.4970155 0.0185036 -0.5064295 -0.237959 0.0101784 0.0191563 0.0092829 0.0263883 1.2003599 -0.2145154 -0.118992 -0.8068195 0.6572864 0.1371133 -0.1840184 0.0916791 -0.0058121 0.0017475 -0.0049318 0.0152419 -0.057583 0.3828556 0.0240561 0.0094647 0.0195724 0.2077739 0.9504709 -0.6161239 -0.1466546 -0.0766811 0.9727552 0.1211236 -0.088456 0.1621659 -0.0551472 2.1039488 0.457828 -0.0858519 -0.1716155 1.4099742 0.128788 -0.150104 0.0849014 0.2940138 0.8011056 0.0123601 -0.0362051 0.0507555 0.2052926 -0.0112436 -0.0318081 -0.0081934 0.2804405 0.077631 0.0631292 0.0860761 0.0078146 0.0145315 0.0026203 0.0698002 -0.0521601 -0.0482598 0.1516485 -0.138627 -0.0161311 -0.0161934 0.1325832 0.0005794 -0.0030747 0.0101683 0.1385062 0.0523125 0.0902827 -0.0841637 0.0247359 0.003333 0.0034169 -0.0809687 0.0485171 -0.0110853 -0.030081 -0.0057645 0.0017614 -0.0908957 0.0631087 -0.0810397 -0.058855 -0.0651361 -0.0651107 -0.0235208 0.0059885 -0.0055207 -0.0868624 0.0259665 0.1143479 0.0364248 0.0853356 -0.0337672 -0.0023858 0.048473 0.0142073 0.1253396 -0.0310067 -0.0256295 0.0223903 -0.0199922 0.1190442 unknown
polarizability: 172.5600202|-17.2749665|133.758085|-11.1446069|10.3495595|52.9041136 unknown
InChI: InChI=1S/C6H6Br2N2O2/c1-10-3(5(11)12-2)4(7)9-6(10)8/h1-2H3
charge 0 multiplicity 1
18 atoms
Br -3.913249 0.51497 0.204307
Br 0.63607 -2.908975 -0.520782
O  2.454697 -0.348545 -0.371133
O  1.769388 1.858827 -0.090527
N  -1.036105 0.8351 0.015733
N  -1.716526 -1.333036 -0.1680
C  0.139894 0.048733 -0.161054
C  -2.094676 -0.054639 0.00065
C  -1.147433 2.299403 0.185677
C  -0.339699 -1.27982 -0.268233
C  1.485817 0.632326 -0.20151
C  3.854781 0.13794 -0.421028
H  -1.622759 2.526101 1.154842
H  -0.137574 2.729663 0.15388
H  -1.762538 2.721999 -0.626461
H  4.115415 0.647599 0.521423
H  3.986155 0.838261 -1.262544
H  4.454443 -0.771605 -0.561538
