program: Gaussian 09
title: 000179970
version: EM64L-G09RevD.01
frameworkgroup: C1[X(C18H27NO4)]
method: RPBEPBE
basis: SDD
operation: Freq
keyword: #p
keyword: freq=noraman
keyword: PBEPBE/SDD
title: #p freq=noraman PBEPBE/SDD
converged: YES YES NO NO
title: Mulliken charges:
elementType: O O O O N C C C C C C C C C C C C C C C C C C H H H H H H H H H H H H H H H H H H H H H H H H H H H
charge: -0.464951 -0.292181 -0.303501 -0.303458 -0.361914 -0.028671 -0.083735 -0.443286 -0.449227 -0.404156 -0.390908 -0.632099 0.503689 -0.410235 -0.401760 -0.358335 -0.391366 0.350536 -0.261317 -0.407399 0.299501 -0.254293 -0.663282 0.230448 0.180000 0.183978 0.228643 0.182915 0.214392 0.200653 0.195835 0.203787 0.192906 0.258033 0.194801 0.333767 0.240072 0.232666 0.242695 0.243608 0.210426 0.220623 0.249399 0.234608 0.339764 0.234902 0.218022 0.223713 0.249062 0.212635
chargesum: 0.00000
title: Mulliken charges with hydrogens summed into heavy atoms:
elementType: O O O O N C C C C C C C C C C C C C C C C C C
charge: -0.131184 -0.292181 -0.303501 -0.303458 -0.022151 0.201777 0.096265 -0.030664 -0.051920 -0.007668 0.005785 -0.179265 0.503689 -0.170164 -0.169095 -0.115641 -0.147758 0.350536 0.169732 0.076607 0.299501 0.198630 0.022127
polarizability: 2.88852169e+02 -4.98563675e-01 1.83001112e+02 -2.68589145e+00 9.33294905e+00 1.83381785e+02
1716.lowfreq: -10.8376 -6.9026 -1.7165 -0.0010 0.0004 0.0007 5.4115 13.6939 20.6842
frequency: -4.6912 11.4287 19.6496 29.3099 34.7746 44.1002 63.3160 68.2460 89.9524 96.9915 127.9337 141.1593 159.5106 160.9748 183.3643 195.6586 224.7785 274.0553 283.9812 303.3036 311.5796 316.5804 321.7201 349.6231 371.9329 384.7587 410.5122 411.6690 428.8976 437.5119 453.6030 491.5796 503.3475 530.0596 551.9988 581.1269 624.1234 632.4783 639.4086 699.2970 716.1610 740.5494 778.8546 792.1593 805.5975 816.9921 819.6266 826.5615 837.6196 844.8800 866.0177 879.4981 897.6165 917.1406 924.2366 941.9371 960.2262 963.5087 968.9813 1000.4254 1005.6843 1033.5678 1040.6461 1046.2942 1054.9043 1060.2314 1087.2813 1095.0682 1096.3179 1103.5458 1120.1157 1130.5515 1139.6922 1155.2389 1156.2519 1179.1146 1190.9720 1200.2164 1210.1932 1213.6263 1222.5967 1232.1258 1247.1647 1258.3221 1265.1075 1282.1681 1282.2313 1297.5079 1306.4019 1313.9616 1329.2410 1331.3081 1337.7022 1341.6048 1347.3953 1353.3864 1359.5213 1372.0211 1385.1514 1387.3356 1392.3638 1415.6728 1455.2228 1459.9021 1461.2117 1461.8311 1464.2111 1468.2140 1468.3798 1474.2210 1477.7832 1483.8606 1493.0542 1501.9022 1585.2781 1621.6912 1662.6557 2909.1908 2950.5891 2961.4557 2962.9226 2967.0483 2969.9185 2971.8167 2982.0922 2989.8722 2994.0300 3023.4737 3025.9321 3032.7184 3033.4544 3035.1306 3044.5897 3049.6851 3079.5885 3084.9185 3088.7808 3115.2358 3120.4401 3122.9267 3157.9664 3161.6036 3561.6541 3573.6412
redmass: 4.0034 3.9778 4.4004 3.9440 4.1265 3.7544 4.7225 4.4718 4.4541 3.8961 4.1115 4.0701 2.8442 3.7731 2.8020 2.7596 1.7220 2.1816 1.1608 1.8741 3.4352 2.6619 3.0502 2.2519 3.5570 3.0721 3.6419 3.0841 3.6564 3.3145 3.3562 3.0350 3.1267 2.4648 2.0068 3.6461 1.3315 6.5928 2.9263 11.9450 3.4107 3.4248 2.0023 1.5246 1.9866 1.6815 1.4026 2.9504 1.7004 2.2828 2.5056 2.0902 1.6531 3.6035 1.8228 1.3960 1.6456 1.6143 2.3941 3.9440 2.8141 3.4236 3.0760 1.6409 1.5294 2.0771 1.7764 2.0443 2.0383 1.8407 1.4407 1.7829 4.3264 1.3246 1.6802 1.3042 1.3777 1.6479 1.2673 1.9688 3.5043 1.3570 1.2467 1.3021 1.2858 1.2938 1.1306 1.2892 1.2553 1.2492 1.3917 1.4138 1.4555 1.5455 1.4979 1.2662 1.3236 1.6583 2.7526 1.2362 1.6640 3.1383 1.0954 1.0858 1.0492 1.0918 1.0932 1.1102 1.0978 1.0953 1.1013 1.0886 1.8549 2.3364 7.0833 6.4409 8.9018 1.0824 1.0676 1.0605 1.0557 1.0743 1.0653 1.0620 1.0692 1.0360 1.0676 1.0997 1.0594 1.0961 1.1049 1.0969 1.1023 1.0984 1.0980 1.0975 1.1032 1.1056 1.0894 1.0890 1.0939 1.0952 1.0660 1.0772
irintensity: 0.1467 0.0293 0.1483 0.5037 1.3803 1.4860 2.6892 4.0249 3.0729 1.9899 0.7934 0.9923 4.0376 1.2518 3.5987 2.4266 4.6075 10.2949 114.6948 11.6765 3.1515 0.6240 18.0199 8.2870 6.4640 14.3779 1.6491 0.4657 2.7686 0.2877 3.5860 10.2852 4.8044 2.9406 15.4424 9.2019 140.1632 0.4951 38.9578 23.1242 1.5482 7.5254 7.6977 3.8934 20.1970 14.6164 0.3567 4.6897 32.7062 15.8235 19.4789 14.7179 3.9823 55.3652 6.9211 2.2319 7.8216 10.1886 15.1360 61.5182 15.3168 107.8837 93.3870 4.0324 8.8828 7.6891 2.4670 3.0745 84.3537 4.2207 14.7091 7.3345 106.8091 18.1031 27.0871 103.4905 17.5799 176.2207 24.6880 111.6102 101.6927 14.4835 1.6810 5.9141 100.9904 5.8358 7.1503 5.3645 0.5033 8.0830 6.1020 1.4677 0.6807 0.5098 6.9578 7.5506 6.2290 4.4792 8.6726 25.9274 2.7268 1.1087 13.3911 34.4540 7.6450 9.6379 4.6046 51.8425 40.8845 5.8155 6.7153 12.1978 427.5628 78.0227 6.2079 41.6001 319.0417 39.2514 18.2997 33.6960 38.7756 11.8281 51.3194 25.4035 58.2086 22.4485 22.4818 55.4649 39.8305 54.7420 61.6523 22.9406 85.1673 28.2614 5.6316 43.0731 2.0799 35.2136 11.9583 24.7952 17.2549 5.5766 3.0757 49.1952
temp: 298.150 k
press: 1.00000 atm
elementType: 8 8 8 8 7 6 6 6 6 6 6 6 6 6 6 6 6 6 6 6 6 6 6 1 1 1 1 1 1 1 1 1 1 1 1 1 1 1 1 1 1 1 1 1 1 1 1 1 1 1
symmnumber: 1
zpe: 1113440.9 jmol-1
zpe.correction: 0.424087 hartree
zpe.thermalcorrener: 0.447277 hartree
zpe.thermalcorrenthalpy: 0.448221 hartree
zpe.thermalcorrgfe: 0.367857 hartree
zpe.sumelectzpe: -1055.992132 hartree
zpe.sumelectthermal: -1055.968942 hartree
zpe.sumelectthermalent: -1055.967998 hartree
zpe.sumelectthermalfe: -1056.048362 hartree
dipole: -3.4406 1.6618 0.5777
dipole: 3.8643
quadrupole: -128.5846 -134.8621 -136.3276
quadrupole: 0.9100 4.2409 1.3037
quadrupole: 4.6735 -1.6040 -3.0695 0.9100 4.2409 1.3037
hfenergy: -1056.4162192 hartree
pointgroup: C01 [X(C18H27N1O4)]
dipole: -1.3907702 0.5382593 0.2957857 debye
polarizability: 288.3878165|6.8645979|181.6312527|-3.7563668|8.8915282|185.2159967 unknown
InChI: InChI=1S/C18H27NO4/c1-2-22-18(21)19-11-12-23-16-9-7-14(8-10-16)13-15-5-3-4-6-17(15)20/h7-10,15,17,19-20H,2-6,11-13H2,1H3
charge 0 multiplicity 1
50 atoms
O  -5.9017 -1.07251 -1.422198
O  2.169266 -1.358816 0.390948
O  5.897401 1.71764 0.832566
O  6.533506 0.497264 -1.090437
N  4.768231 -0.181075 0.307456
C  -4.235225 0.019545 -0.039097
C  -5.748885 -0.113107 -0.305641
C  -3.982491 1.084906 1.058884
C  -6.399506 1.242883 -0.651548
C  -4.630982 2.447538 0.720412
C  -6.146946 2.29143 0.457773
C  -3.612211 -1.361988 0.323379
C  -2.091387 -1.364268 0.323964
C  -1.369347 -1.378761 -0.895346
C  -1.343385 -1.344749 1.531622
C  0.043618 -1.373303 -0.925211
C  0.065304 -1.340462 1.52652
C  0.762149 -1.354619 0.295129
C  2.945731 -1.385428 -0.86137
C  4.416396 -1.388824 -0.440655
C  5.791493 0.651304 -0.082641
C  6.935421 2.735245 0.508938
C  6.393777 3.784772 -0.466418
H  -3.773542 0.368708 -0.98739
H  -6.239802 -0.525376 0.608083
H  -4.395647 0.714682 2.022189
H  -2.892639 1.202457 1.206968
H  -7.489662 1.106926 -0.811115
H  -5.970272 1.598953 -1.609765
H  -4.457427 3.165251 1.545304
H  -4.145684 2.871365 -0.182746
H  -6.595799 3.260997 0.16922
H  -6.649654 1.971064 1.394129
H  -3.993819 -2.096327 -0.409297
H  -3.989421 -1.668497 1.320307
H  -6.862059 -1.138139 -1.656047
H  -1.921891 -1.405629 -1.842834
H  -1.874078 -1.340997 2.491642
H  0.562155 -1.391245 -1.888646
H  0.639331 -1.333403 2.458534
H  2.706713 -2.302707 -1.437543
H  2.710904 -0.491067 -1.472358
H  5.065113 -1.427398 -1.332961
H  4.612342 -2.291198 0.170421
H  4.222386 0.062172 1.135142
H  7.816901 2.219247 0.089068
H  7.183728 3.172466 1.489762
H  5.4775 4.255328 -0.069349
H  6.167788 3.324988 -1.443246
H  7.149808 4.576861 -0.623999
