program: Gaussian 09
title: 000179957
version: EM64L-G09RevD.01
frameworkgroup: C1[X(C14H19NO2)]
method: RPBEPBE
basis: SDD
operation: Freq
keyword: #p
keyword: freq=noraman
keyword: PBEPBE/SDD
title: #p freq=noraman PBEPBE/SDD
converged: YES YES NO NO
title: Mulliken charges:
elementType: O O N C C C C C C C C C C C C C C H H H H H H H H H H H H H H H H H H H
charge: -0.232081 -0.259817 -0.312762 -0.063456 0.131265 -0.324767 0.139730 0.449738 -0.698064 -0.417514 0.385601 -0.525170 -0.415213 -0.425718 -0.827928 -0.245234 -0.701503 0.238827 0.189614 0.227750 0.220160 0.220975 0.251336 0.260925 0.222884 0.203801 0.203166 0.237219 0.233044 0.231590 0.251396 0.227516 0.224597 0.278181 0.207588 0.212323
chargesum: 0.00000
title: Mulliken charges with hydrogens summed into heavy atoms:
elementType: O O N C C C C C C C C C C C C C C
charge: -0.232081 -0.259817 -0.312762 0.175371 0.131265 0.092597 0.139730 0.449738 -0.005593 0.066294 0.385601 -0.118202 -0.177994 -0.192673 -0.117426 -0.020637 -0.003411
polarizability: 1.81106234e+02 2.29139111e+00 1.62502996e+02 -2.37624937e+00 4.76003830e+00 1.29268767e+02
1716.lowfreq: -14.2126 -8.8509 -0.0003 0.0006 0.0008 6.4517 33.4767 46.3321 65.3003
frequency: 32.3333 46.3050 65.2957 92.7750 109.1839 112.2707 116.7198 137.7246 179.5711 189.2927 203.1954 234.4615 263.6604 276.6304 315.4227 330.3300 356.2675 368.4025 427.1835 449.7972 476.7523 481.5228 503.2831 522.5348 554.0458 568.8554 597.5480 617.6109 625.5920 741.4023 757.9098 794.7177 799.3791 873.9691 892.6411 898.0109 904.7942 912.0262 949.7138 980.2220 980.5805 989.7420 1005.4667 1013.6061 1044.2512 1056.1623 1056.7033 1074.7731 1102.8836 1103.8105 1140.2412 1158.9380 1179.1572 1191.6923 1208.8423 1243.4659 1255.7541 1264.8874 1269.0257 1299.9313 1310.4850 1314.4166 1325.6877 1358.5849 1367.3414 1378.9162 1389.5157 1392.9455 1400.5503 1437.5649 1445.4077 1453.1810 1457.7736 1465.7384 1470.3792 1473.4101 1477.5316 1480.1006 1482.0947 1497.5460 1581.8954 1599.4152 1602.5507 2936.4801 2952.9062 2974.2773 2978.0091 2979.6423 2983.3199 2990.9282 3046.4610 3056.8248 3075.6050 3081.8130 3089.1611 3091.9501 3096.2239 3100.3948 3101.4060 3117.3090 3127.3600 3153.9356
redmass: 3.7805 3.5379 3.8105 2.3560 2.0295 2.9555 2.4404 2.0936 3.0973 1.2105 2.1120 1.2742 3.1981 3.0671 2.3597 2.7099 2.7497 3.9716 3.1047 4.7744 3.5937 4.9405 4.0997 4.1037 3.9632 4.0040 3.8517 4.4307 3.2905 5.1178 2.6250 1.3609 1.3211 2.2247 2.9564 3.1461 1.3856 2.8043 1.8027 1.4114 1.7456 2.0198 2.2956 2.0053 1.5816 2.5585 3.8594 1.7554 2.5285 1.6381 2.5636 2.4894 1.1573 1.6609 2.0857 1.4193 1.3720 1.8464 1.6763 1.3798 1.5507 1.6132 1.2524 1.4342 6.0152 2.2373 1.2010 1.2073 1.2317 1.1049 2.2837 1.0888 2.4756 1.0594 1.0452 1.0722 1.0758 1.0645 1.2191 1.0795 9.2652 6.9230 6.6760 1.0692 1.0687 1.0467 1.0764 1.0461 1.0525 1.0365 1.0971 1.0923 1.0994 1.0977 1.0969 1.0996 1.0934 1.1010 1.0996 1.0860 1.0915 1.0993
irintensity: 0.3481 1.4563 0.3004 0.3724 2.1835 1.5892 3.2126 1.5859 2.5457 0.9322 1.2237 0.7986 0.7987 8.6347 1.2306 6.0125 1.1623 5.8828 3.8340 3.6869 6.2951 20.6498 2.1611 1.9699 3.0638 7.0181 3.0905 12.4804 4.0148 2.1984 10.3636 39.2109 9.7102 5.1970 10.5292 10.7244 1.9468 23.0931 0.9406 1.5231 1.6306 5.4433 1.8585 3.2117 6.4541 25.1745 42.5752 5.7292 2.0942 5.5140 7.0175 7.1596 2.4501 10.9486 24.5095 1.0330 13.0491 1.3779 4.7390 21.1083 3.6976 109.1627 5.5142 19.5731 2.9722 65.0781 16.5155 23.0267 11.9355 5.7302 11.5857 5.3311 10.7668 13.8368 3.6729 19.8893 6.9045 6.1686 30.1333 16.4154 176.0896 4.6542 32.5924 41.6194 37.9517 9.5845 63.7387 36.4011 37.8599 25.1034 11.3375 18.6121 53.9322 2.7215 56.3366 19.4529 5.6370 11.9788 20.8157 1.3818 22.8942 33.3775
temp: 298.150 k
press: 1.00000 atm
elementType: 8 8 7 6 6 6 6 6 6 6 6 6 6 6 6 6 6 1 1 1 1 1 1 1 1 1 1 1 1 1 1 1 1 1 1 1
symmnumber: 1
zpe: 792503.9 jmol-1
zpe.correction: 0.301849 hartree
zpe.thermalcorrener: 0.318990 hartree
zpe.thermalcorrenthalpy: 0.319934 hartree
zpe.thermalcorrgfe: 0.257015 hartree
zpe.sumelectzpe: -748.802453 hartree
zpe.sumelectthermal: -748.785312 hartree
zpe.sumelectthermalent: -748.784368 hartree
zpe.sumelectthermalfe: -748.847287 hartree
dipole: -0.2818 -1.3309 3.7655
dipole: 4.0038
quadrupole: -100.9497 -96.7745 -105.6122
quadrupole: 2.5249 2.7281 5.0836
quadrupole: 0.1624 4.3376 -4.5000 2.5249 2.7281 5.0836
hfenergy: -749.1043022 hartree
pointgroup: C01 [X(C14H19N1O2)]
dipole: -0.1777774 -0.3242 1.531194 debye
polarizability: 181.4063956|0.5227537|162.9655839|-1.1882064|0.7025588|128.5060176 unknown
InChI: InChI=1S/C14H19NO2/c1-4-12-7-5-6-10(2)14(12)15-11(3)8-17-9-13(15)16/h5-7,11H,4,8-9H2,1-3H3
charge 0 multiplicity 1
36 atoms
O  3.634256 -0.505391 -0.060008
O  0.843952 0.825779 -2.071187
N  0.809529 -0.14429 0.05883
C  1.541124 -0.745957 1.228242
C  -0.649028 -0.223201 0.040923
C  2.996231 -0.247929 1.233017
C  1.459488 0.341868 -1.07218
C  -1.42621 0.927101 0.352261
C  0.853801 -0.419282 2.568775
C  2.995751 0.320562 -1.088692
C  -1.258678 -1.469676 -0.286324
C  -0.808707 2.293965 0.615116
C  -2.838098 0.794168 0.37501
C  -2.671396 -1.557971 -0.253969
C  -0.433321 -2.681049 -0.684337
C  -3.459245 -0.436652 0.084674
C  -1.004217 3.259812 -0.586007
H  1.56352 -1.846909 1.09454
H  3.032739 0.837521 1.478385
H  3.585649 -0.808334 1.976876
H  1.417976 -0.887563 3.395773
H  0.815904 0.670607 2.744243
H  -0.177823 -0.806441 2.596946
H  3.318089 -0.083492 -2.061159
H  3.344996 1.373875 -1.015906
H  -1.27298 2.73902 1.517729
H  0.271839 2.193482 0.821442
H  -3.44917 1.670909 0.622043
H  -3.152189 -2.510423 -0.506506
H  -1.055261 -3.409689 -1.231335
H  0.414073 -2.399307 -1.333113
H  -0.014517 -3.205979 0.196624
H  -4.551457 -0.521363 0.109234
H  -0.543712 2.833445 -1.493013
H  -0.539429 4.24099 -0.376141
H  -2.077876 3.426797 -0.788903
