program: Gaussian 09
title: 000016074
version: EM64L-G09RevD.01
frameworkgroup: C1[X(C7H7BrN2O)]
method: RPBEPBE
basis: SDD
operation: Freq
keyword: #p
keyword: freq=noraman
keyword: PBEPBE/SDD
title: #p freq=noraman PBEPBE/SDD
converged: NO YES NO NO
title: Mulliken charges:
elementType: Br O N N C C C C C C C H H H H H H H
charge: -0.002295 -0.286992 -0.475873 -0.660075 0.490059 -0.431074 -0.328557 -0.153996 -0.163502 -0.236345 0.270328 0.220134 0.314360 0.291530 0.248071 0.248122 0.349695 0.306411
chargesum: 0.00000
title: Mulliken charges with hydrogens summed into heavy atoms:
elementType: Br O N N C C C C C C C
charge: -0.002295 -0.286992 -0.184343 -0.003970 0.490059 -0.210940 -0.014197 0.094074 0.084621 -0.236345 0.270328
polarizability: 1.93782567e+02 4.24507445e+00 1.00680490e+02 4.12487242e-03 -1.47195803e-03 4.09957169e+01
1716.lowfreq: -11.3154 -0.0003 0.0004 0.0006 2.7859 3.6473 49.1122 56.7578 122.4815
frequency: 49.1099 56.7464 122.4808 129.5017 223.0375 248.9016 271.3891 330.4744 356.0438 409.5255 411.5568 498.1365 512.1159 568.3201 588.7541 624.0008 686.2289 702.7442 713.0939 810.5949 825.1897 847.7990 937.7452 969.8689 983.8386 988.3176 1042.9941 1062.7835 1116.8407 1186.4987 1264.3784 1283.2903 1306.5808 1372.3124 1398.8938 1475.0400 1504.5811 1585.1414 1604.3672 1614.6652 1662.9108 3114.7942 3163.7298 3172.4133 3193.8152 3532.0874 3544.0456 3697.0972
redmass: 4.4304 5.8148 7.8026 4.4231 11.3181 6.1066 1.4664 3.1227 5.3620 3.0009 4.6993 1.2920 2.0506 4.1122 1.2111 6.8571 6.6675 3.8536 7.5698 1.4176 4.9439 1.4064 1.3569 4.1366 1.3171 4.7306 1.9656 2.3587 1.3500 1.1073 1.8397 2.0223 1.8114 5.2513 4.2480 2.4229 2.5896 4.0150 4.2938 1.5165 3.7094 1.0902 1.0909 1.0947 1.0953 1.0708 1.0510 1.1040
irintensity: 10.8757 5.7180 5.1531 0.2332 0.0740 10.1036 17.4697 8.6930 1.4108 0.1675 19.4182 354.6199 0.5748 0.9738 68.3739 0.5811 19.2510 7.4072 20.3997 45.2275 12.1964 62.3847 1.3779 0.4624 3.7315 37.6642 26.6098 21.9963 15.1469 7.8663 69.9139 21.5996 97.1712 251.0961 38.2807 88.5329 719.3519 87.2424 33.3114 9.3177 273.5035 19.4032 4.3430 4.0882 10.2791 14.1772 62.5285 43.8640
temp: 298.150 k
press: 1.00000 atm
elementType: 35 8 7 7 6 6 6 6 6 6 6 1 1 1 1 1 1 1
symmnumber: 1
zpe: 345510.1 jmol-1
zpe.correction: 0.131598 hartree
zpe.thermalcorrener: 0.142091 hartree
zpe.thermalcorrenthalpy: 0.143035 hartree
zpe.thermalcorrgfe: 0.093822 hartree
zpe.sumelectzpe: -468.362849 hartree
zpe.sumelectthermal: -468.352356 hartree
zpe.sumelectthermalent: -468.351411 hartree
zpe.sumelectthermalfe: -468.400624 hartree
dipole: 4.2037 4.4676 0.0000
dipole: 6.1344
quadrupole: -55.8002 -67.2162 -78.5117
quadrupole: 16.0902 -0.0025 -0.0009
quadrupole: 11.3758 -0.0401 -11.3357 16.0902 -0.0025 -0.0009
hfenergy: -468.4944464 hartree
pointgroup: C01[X(C7H7Br1N2O1)]
dipole: -1.5364051 1.8612411 0.000017 debye
dipolederiv: -0.7865573 0.1142514 -0.0000553 0.1293376 -0.0960403 0.0000504 -0.0001521 -0.000028 -0.0458903 -0.8090337 0.0040028 0.0000426 -0.2233328 -1.0103582 -0.0001565 0.0002098 0.0002568 -0.3835842 -2.1068891 -0.1097815 0.0000828 -0.5176191 -0.3561569 0.0000899 -0.000019 -0.0000126 -0.3569788 -1.5241542 0.3438263 -0.0001158 0.4656387 -0.3980753 -0.0000574 0.0002289 -0.0001241 -0.788123 1.5269897 -0.1204668 0.0000548 -0.4055151 0.0104906 -0.0000103 0.0001055 -0.0000161 0.1164826 -0.2952141 0.0344167 0.0000149 -0.1433972 0.0543409 0.0000104 -0.0000587 0.000022 -0.2171063 -0.2789191 0.009679 0.0000138 0.2096297 -0.0507713 0.0000167 -0.0000348 -0.0000182 -0.1659444 -0.2278091 0.0669109 -0.0000207 0.0838632 0.060616 -0.0000021 0.0000615 0.0000397 -0.0830275 -0.226596 0.0166991 -0.0000435 0.048612 0.0999755 0.000034 0.0000457 0.0000275 -0.0836998 1.1972424 -0.2304841 0.000126 -0.2590204 -0.0357935 -0.0000466 0.0001263 0.0000002 -0.1507955 2.687734 -0.1283015 -0.0002438 0.5450556 1.4152077 0.0001344 -0.0006781 -0.0000672 0.346859 0.0003233 0.1095939 -0.0000067 0.0906501 -0.082917 -0.0000198 -0.0000362 -0.0000179 0.1715224 0.1676737 -0.0476596 -0.0000212 -0.0107425 0.0796813 -0.0000132 -0.0000387 -0.000003 0.1847837 0.1155074 -0.0183664 -0.0000109 0.0008817 0.0725249 -0.0000031 -0.0000351 -0.0000194 0.3226121 0.0273477 -0.0818396 -0.0000025 -0.0822555 0.0107353 -0.0000049 -0.0000167 -0.0000159 0.1616058 0.0761908 0.0510783 0.0000026 0.0589892 -0.0329626 -0.000023 0.0000187 0.0000021 0.156212 0.2565207 0.0010681 0.000077 0.0354609 0.1643174 -0.0000052 0.0001161 0.0000021 0.4043744 0.1996429 -0.0146269 0.0001057 -0.026236 0.0951855 0.0000062 0.0001572 -0.0000281 0.410698 unknown
polarizability: 192.8417678|-10.2335682|101.6212894|0.0042116|0.0012014|40.9957169 unknown
InChI: InChI=1S/C7H7BrN2O/c8-5-1-3-6(4-2-5)10-7(9)11/h1-4,10H,9H2
charge 0 multiplicity 1
18 atoms
Br 4.42981 -0.496294 0.000152
O  -2.670478 -1.399737 0.000169
N  -1.655372 0.737903 -0.000255
N  -3.991201 0.514525 0.000224
C  -0.277265 0.394206 -0.000147
C  0.66207 1.462049 -0.000016
C  0.194768 -0.946423 -0.000186
C  2.048037 1.206604 0.000065
C  1.583154 -1.201048 -0.000094
C  2.497529 -0.129346 0.00003
C  -2.75723 -0.13735 -0.000266
H  0.313768 2.503043 0.000021
H  -0.524082 -1.767617 -0.000286
H  -1.850599 1.740726 -0.000257
H  2.759918 2.036624 0.000163
H  1.941527 -2.234541 -0.000124
H  -4.815569 -0.081013 0.000615
H  -4.113486 1.524789 0.000292
