program: Gaussian 09
title: 000179937
version: EM64L-G09RevD.01
frameworkgroup: C1[X(C17H21O5PS)]
method: RPBEPBE
basis: SDD
operation: Freq
keyword: #p
keyword: freq=noraman
keyword: PBEPBE/SDD
title: #p freq=noraman PBEPBE/SDD
converged: YES YES NO NO
title: Mulliken charges:
elementType: S P O O O O O C C C C C C C C C C C C C C C C C H H H H H H H H H H H H H H H H H H H H H
charge: 0.021912 0.972900 -0.533944 -0.526833 -0.566992 -0.287371 -0.271805 -0.354749 -0.609766 -0.652168 0.238185 0.263841 0.202806 0.197334 -0.270541 -0.321638 -0.329928 -0.324572 -0.236096 -0.237882 -0.214564 -0.215211 -0.501631 -0.512922 0.306227 0.215975 0.253491 0.232176 0.226795 0.241468 0.226450 0.258129 0.271465 0.255070 0.253914 0.232313 0.232650 0.231454 0.231319 0.229407 0.226842 0.235058 0.242471 0.227355 0.241606
chargesum: 0.00000
title: Mulliken charges with hydrogens summed into heavy atoms:
elementType: S P O O O O O C C C C C C C C C C C C C C C C C
charge: 0.021912 0.972900 -0.533944 -0.526833 -0.566992 -0.287371 -0.271805 -0.048522 0.091876 0.042545 0.238185 0.263841 0.202806 0.197334 -0.012412 -0.050173 -0.074858 -0.070658 -0.003784 -0.005232 0.016890 0.016108 0.189676 0.198510
polarizability: 2.97763864e+02 -1.93571046e+01 2.47040251e+02 1.17924109e+01 -2.45498061e+01 2.33209734e+02
1716.lowfreq: -12.9670 -10.4988 0.0009 0.0011 0.0014 4.1935 11.4993 19.5037 23.6799
frequency: -7.7587 17.9940 22.4323 24.9264 43.4097 46.3301 52.7123 63.6946 70.0173 81.3846 106.8827 117.4594 125.6907 158.7127 162.8593 189.7953 198.3344 217.3657 220.6225 232.8786 242.0781 250.0275 256.4012 278.6737 286.1418 305.2943 317.5850 326.4000 348.7778 366.1012 401.2730 416.1205 431.7776 445.6858 472.1960 487.3679 516.6719 522.2282 543.0214 548.6850 556.3487 583.7399 586.4384 610.9324 639.0835 707.9273 710.9371 721.0300 727.6147 759.8191 760.5798 823.9923 826.1416 848.9278 850.6140 880.8847 927.9029 936.4237 937.9664 949.4130 966.9997 972.5634 973.6736 973.9658 1020.7041 1035.6554 1038.3426 1059.0058 1079.0316 1082.4673 1110.5170 1119.8438 1135.5884 1151.6154 1152.4663 1157.2316 1157.9678 1160.2832 1167.0134 1168.8483 1234.8945 1242.0490 1256.8000 1262.6303 1267.2872 1313.3152 1375.8880 1378.2494 1385.2129 1402.6858 1421.3184 1423.6290 1442.8035 1444.5698 1455.0047 1457.4295 1459.3001 1463.4920 1471.4848 1474.0416 1476.0855 1476.9386 1477.5140 1480.8533 1579.1615 1579.2995 1601.9726 1604.8175 2979.9055 2983.3996 2984.5549 2997.3759 3049.2355 3071.7728 3079.6577 3090.0873 3094.5753 3100.8184 3104.9732 3114.3090 3121.9940 3138.9684 3139.4645 3151.3415 3154.7135 3164.5708 3167.0030 3176.6515 3178.1876
redmass: 3.9010 5.5595 4.7125 3.6709 4.1317 4.5721 3.2297 5.9321 3.1590 5.5677 5.5172 5.7050 5.4155 5.6908 5.2409 4.4912 3.1532 1.4556 1.4245 1.7666 1.6068 1.3801 1.7300 4.0047 4.8093 4.7922 5.0389 2.9303 5.5184 7.5379 2.9367 5.4412 5.2839 4.7910 4.1983 5.5273 5.7936 5.6325 4.9324 4.0768 4.2834 5.5293 5.9898 8.5474 8.5049 4.1303 4.4060 5.6754 5.9871 1.2616 1.2668 6.4370 6.6179 1.4366 1.4688 2.7257 1.1617 1.3745 1.3633 1.3740 8.4639 1.4514 1.8298 2.4886 12.9823 2.0707 2.1501 1.3757 2.8548 2.6333 1.2463 1.2381 2.3833 1.8547 1.3794 1.4594 1.5313 1.8036 1.1003 1.2639 3.1967 3.2002 1.2132 1.5425 1.5236 1.4186 10.0362 9.1509 1.2075 1.1999 1.6321 1.6468 1.6170 1.6124 1.0583 1.0504 1.0515 1.0435 1.1414 1.3701 1.0707 1.6949 1.6634 1.0484 7.2717 7.3250 6.4576 6.4144 1.0370 1.0293 1.0358 1.0284 1.0882 1.0974 1.0981 1.1052 1.1008 1.1000 1.1048 1.1042 1.1049 1.0855 1.0857 1.0901 1.0900 1.0947 1.0948 1.1008 1.1006
irintensity: 3.6066 1.1455 0.2221 0.7079 2.8693 0.2223 1.5882 1.4847 2.3934 4.7403 5.6237 0.5336 1.7174 2.2775 1.0227 6.5434 1.2463 2.9251 1.8390 1.5154 2.4067 2.4936 1.2535 4.2160 5.1710 4.8463 3.8355 0.4996 6.4209 28.1023 6.3425 23.5382 11.9980 10.2809 36.1672 92.4907 19.7021 33.1306 2.6333 15.7033 6.5000 4.5137 16.8535 46.0688 49.8658 2.1140 6.4272 46.0439 51.5267 75.3785 123.3870 49.5390 141.6689 1.9265 2.0446 2.6247 4.7494 2.3633 4.7122 0.4567 23.7834 3.3674 10.2613 15.2403 63.1566 17.1987 28.4546 60.3064 48.1851 47.2892 0.8065 2.2480 3.5408 39.9087 8.3115 11.0271 15.3183 24.1939 8.3127 10.9678 51.5064 176.6785 36.6469 7.4494 8.4470 2.5272 20.3497 36.6659 24.0751 14.9445 19.0543 22.8817 10.1008 10.5975 19.0126 7.0233 21.0499 2.3624 47.0211 22.1264 5.5421 40.0101 118.0953 27.6110 5.8699 7.7639 8.4166 38.5749 12.1852 52.0674 29.7033 46.4476 0.5737 16.3336 28.4510 17.3852 9.6647 23.4282 25.8153 31.5935 31.4533 2.2695 2.5914 12.7162 13.1103 8.0738 10.2210 15.4808 12.3638
temp: 298.150 k
press: 1.00000 atm
elementType: 16 15 8 8 8 8 8 6 6 6 6 6 6 6 6 6 6 6 6 6 6 6 6 6 1 1 1 1 1 1 1 1 1 1 1 1 1 1 1 1 1 1 1 1 1
symmnumber: 1
zpe: 908556.6 jmol-1
zpe.correction: 0.346051 hartree
zpe.thermalcorrener: 0.371920 hartree
zpe.thermalcorrenthalpy: 0.372864 hartree
zpe.thermalcorrgfe: 0.287714 hartree
zpe.sumelectzpe: -1773.970908 hartree
zpe.sumelectthermal: -1773.945039 hartree
zpe.sumelectthermalent: -1773.944095 hartree
zpe.sumelectthermalfe: -1774.029245 hartree
dipole: 2.0882 -0.2862 0.5175
dipole: 2.1704
quadrupole: -147.0884 -150.3132 -150.9672
quadrupole: -8.5463 1.4993 -4.7927
quadrupole: 2.3678 -0.8569 -1.5109 -8.5463 1.4993 -4.7927
hfenergy: -1774.3169592 hartree
pointgroup: C01 [X(C17H21O5P1S1)]
dipole: -0.5191197 0.5283169 0.4248747 debye
polarizability: 255.0223203|-27.199636|265.6638052|-1.8600318|38.6919166|257.3277237 unknown
InChI: InChI=1S/C17H21O5PS/c1-13(2)24-23(18,21-16-11-7-5-9-14(16)19-3)22-17-12-8-6-10-15(17)20-4/h5-13H,1-4H3
charge 0 multiplicity 1
45 atoms
S  1.084835 2.603679 1.18485
P  0.817653 1.020662 -0.414456
O  -0.245188 -0.25745 0.211495
O  2.331694 0.19077 -0.143214
O  0.458609 1.537724 -1.87664
O  -2.513502 0.105264 2.090988
O  2.89361 -2.439363 1.212203
C  -0.065574 3.942479 0.372406
C  -1.541532 3.532979 0.460321
C  0.257296 5.252436 1.11219
C  -1.598815 -0.383318 -0.210085
C  2.641811 -1.007675 -0.867919
C  -2.651108 -0.229157 0.739988
C  2.920753 -2.214413 -0.163238
C  -1.887825 -0.700968 -1.557477
C  2.731637 -0.953186 -2.27857
C  -3.989435 -0.37997 0.293875
C  3.287283 -3.356736 -0.925833
C  -3.222472 -0.848518 -1.983667
C  3.088294 -2.098921 -3.015873
C  -4.275613 -0.678806 -1.051961
C  3.366298 -3.30604 -2.328846
C  -1.308984 -0.291998 2.846439
C  2.601848 -1.364588 2.177542
H  0.268789 3.989137 -0.678223
H  -2.169743 4.351533 0.058722
H  -1.756517 2.629668 -0.136592
H  -1.845868 3.341624 1.504187
H  -0.334976 6.0710 0.662132
H  1.32565 5.517063 1.033178
H  -0.014008 5.188548 2.181555
H  -1.056345 -0.811606 -2.260432
H  2.519079 -0.003513 -2.780766
H  -4.784492 -0.258313 1.035999
H  3.500828 -4.277303 -0.373968
H  -3.437374 -1.088498 -3.029564
H  3.154438 -2.04831 -4.107021
H  -5.317596 -0.788178 -1.370835
H  3.647554 -4.206448 -2.885074
H  -1.623297 -0.255768 3.901562
H  -0.99143 -1.314891 2.576507
H  -0.480813 0.414708 2.669643
H  1.565865 -1.004297 2.06479
H  2.736025 -1.845279 3.159102
H  3.302759 -0.52146 2.061277
