program: Gaussian 09
title: 000016106
version: EM64L-G09RevD.01
frameworkgroup: C1[X(C19H21N3)]
method: RPBEPBE
basis: SDD
operation: Freq
keyword: #pfreq=noraman
keyword: PBEPBE/SDD
title: #p freq=noraman PBEPBE/SDD
converged: YES YES NO NO
title: Mulliken charges:
elementType: N N N C C C C C C C C C C C C C C C C C C C H H H H H H H H H H H H H H H H H H H H H
charge: -0.160510 -0.061798 -0.119030 -0.372385 -0.388356 -0.377044 -0.369823 0.057199 0.161522 0.386963 -0.614524 -0.758981 0.396353 0.053761 -0.359612 -0.424060 -0.425202 -0.255756 -0.360363 -0.232516 -0.256352 -0.229911 0.217560 0.255777 0.242313 0.230381 0.186650 0.214305 0.213675 0.180755 0.188227 0.223133 0.225454 0.224486 0.240242 0.259310 0.234751 0.223791 0.229935 0.245606 0.228637 0.222730 0.222707
chargesum: 0.00000
title: Mulliken charges with hydrogens summed into heavy atoms:
elementType: N N N C C C C C C C C C C C C C C C C C C C
charge: -0.160510 -0.061798 -0.119030 0.100952 0.084338 0.023911 0.024607 0.057199 0.161522 0.386963 0.022290 -0.294253 0.396353 0.053761 -0.100302 -0.189309 -0.201412 -0.025821 -0.114757 -0.003879 -0.033622 -0.007204
polarizability: 3.17115629e+02 -1.65964911e+01 2.42183615e+02 6.72573372e+00 7.48886360e+00 1.49791110e+02
1716.lowfreq: -10.9942 -2.3060 -0.0009 0.0002 0.0006 4.6800 31.8906 49.7804 61.2572
frequency: 31.7973 49.7758 61.2568 78.5335 88.1502 141.3258 154.5353 173.4507 198.9906 217.1833 237.4887 252.4749 298.4728 301.5417 321.9897 324.2836 358.3078 362.9756 385.3944 403.0893 444.5322 458.4839 475.1544 477.8607 505.5209 532.7636 554.5213 578.5407 604.7873 613.4394 645.6943 664.0292 699.1085 736.0321 745.5359 750.2861 763.2188 771.1498 781.6028 813.4033 839.0158 842.0247 869.4509 886.6069 899.9093 927.8226 940.1666 944.4335 961.7581 976.6658 991.9996 1004.8920 1022.8181 1032.9058 1039.7521 1047.9170 1067.6082 1075.8380 1084.4924 1095.4526 1124.3572 1142.3740 1147.6043 1158.5371 1160.6678 1167.2145 1174.6111 1190.0042 1193.2086 1204.6501 1223.0296 1247.2577 1268.1999 1273.7465 1276.9317 1288.0403 1291.5338 1310.9308 1329.9853 1352.0197 1360.7792 1370.9546 1371.3788 1380.4034 1405.8349 1429.9610 1432.0308 1443.6382 1455.1977 1457.7797 1460.0821 1460.8339 1468.6499 1468.8782 1474.2198 1479.3007 1481.7394 1552.3501 1567.3324 1586.2938 1606.9163 1608.8273 2830.1850 2844.5653 2862.9282 2944.2664 2963.4943 2966.8996 3019.2405 3028.2365 3032.5088 3059.5908 3077.5186 3094.7116 3095.8216 3112.0947 3121.4859 3126.8646 3128.3087 3142.2875 3147.4857 3161.3123 3162.2956
redmass: 3.9701 3.2799 4.4640 4.3332 4.2910 3.3978 3.7358 3.6522 4.0357 2.0833 1.4323 3.8002 3.5546 2.6481 2.2610 3.9946 3.3854 3.4746 2.4353 2.2300 3.3668 3.8769 2.7918 3.6001 4.1818 4.2640 4.2369 3.8982 4.2921 4.4983 3.2145 5.1061 5.0148 2.7927 3.2472 2.3175 1.7433 2.8627 2.1075 3.6358 2.1476 1.9229 1.5257 1.7938 3.2799 1.7390 2.2136 1.5135 1.4228 1.3142 1.3281 2.4748 2.7219 2.1489 2.1996 1.6620 1.6970 1.8620 1.9069 2.3742 1.5643 1.8905 2.6352 1.1210 2.9443 1.0753 1.0599 2.2631 1.0895 2.4700 2.6417 1.8197 1.3885 1.8978 1.6463 1.9696 1.5364 1.6664 1.2772 1.4065 1.4094 6.0357 1.5044 5.2006 2.8149 1.1749 2.3962 2.4754 1.0797 1.1918 1.1020 1.0654 1.6038 1.4484 1.1173 2.6270 1.0536 8.4492 6.4801 7.3364 6.4077 6.6457 1.0706 1.0672 1.0596 1.0703 1.0692 1.0654 1.0727 1.0875 1.0898 1.0957 1.1010 1.0912 1.0916 1.0873 1.0853 1.0878 1.0890 1.0942 1.0936 1.1007 1.1001
irintensity: 0.2038 0.2896 0.1259 1.3155 0.8602 2.3399 0.9888 7.8867 1.6286 0.9395 0.7819 1.4460 1.5668 8.4908 3.8481 6.0122 3.5578 1.6655 0.7499 3.2651 9.8606 4.2430 0.1746 2.8400 1.4469 0.9530 0.6759 1.8074 3.1332 6.7766 13.5691 9.6090 15.0346 9.8489 3.7868 16.4719 60.7044 25.6306 37.9309 6.2077 0.4992 1.3476 0.8967 2.3022 3.9874 3.1615 6.1450 1.7411 4.5151 0.0615 2.1613 96.6144 14.4232 9.9462 2.5204 6.6426 14.0244 7.7203 4.1469 46.1511 17.3702 11.0901 44.6734 0.7366 17.0835 1.0698 0.8765 12.1791 1.6243 13.0392 5.4807 96.7553 0.9768 41.7478 19.3028 39.6714 67.8316 12.9844 0.1870 1.9862 39.6322 1.3556 0.7725 7.7215 171.9693 2.1609 19.5214 2.7131 3.3025 21.2793 3.5483 25.8236 53.6760 7.4993 10.8838 12.2689 8.6733 417.1729 2.1912 140.4204 6.7984 1.2136 64.9496 50.6482 208.4718 62.0653 53.4756 29.5978 51.6163 48.5234 62.7717 17.9839 31.1463 12.8965 9.0890 10.0217 2.5595 11.6900 3.0635 24.9569 30.9084 38.0698 29.2755
temp: 298.150 k
press: 1.00000 atm
elementType: 7 7 7 6 6 6 6 6 6 6 6 6 6 6 6 6 6 6 6 6 6 6 1 1 1 1 1 1 1 1 1 1 1 1 1 1 1 1 1 1 1 1 1
symmnumber: 1
zpe: 941333.1 jmol-1
zpe.correction: 0.358535 hartree
zpe.thermalcorrener: 0.376739 hartree
zpe.thermalcorrenthalpy: 0.377683 hartree
zpe.thermalcorrgfe: 0.312519 hartree
zpe.sumelectzpe: -899.285039 hartree
zpe.sumelectthermal: -899.266835 hartree
zpe.sumelectthermalent: -899.265891 hartree
zpe.sumelectthermalfe: -899.331054 hartree
dipole: -2.2357 2.2671 -0.2524
dipole: 3.1940
quadrupole: -116.5798 -123.4047 -130.4702
quadrupole: 3.8770 5.8653 3.5588
quadrupole: 6.9051 0.0802 -6.9853 3.8770 5.8653 3.5588
hfenergy: -899.6435738 hartree
pointgroup: C01 [X(C19H21N3)]
dipole: 0.9449001 0.8257821 0.0658826 debye
polarizability: 319.2275099|10.9253053|239.3875971|5.2345103|-11.3396875|150.4752476 unknown
InChI: InChI=1S/C19H21N3/c1-21-10-12-22(13-11-21)19-17-8-4-2-6-15(17)14-16-7-3-5-9-18(16)20-19/h2-9H,10-14H2,1H3
charge 0 multiplicity 1
43 atoms
N  1.715019 -0.512733 -0.215733
N  4.539654 -1.07243 -0.223957
N  -0.483494 -1.270958 -0.012029
C  2.194584 -1.909446 -0.147586
C  2.660066 0.380374 -0.922931
C  3.589434 -1.949856 0.501388
C  4.046155 0.322993 -0.257656
C  0.344105 -0.240072 -0.10623
C  -0.054985 1.197101 0.054604
C  -1.213144 1.697246 -0.610218
C  5.91599 -1.174697 0.295572
C  -2.025971 0.756701 -1.487615
C  -2.705928 -0.27982 -0.60179
C  -1.88349 -1.207129 0.121317
C  0.658498 2.042461 0.947732
C  -1.614827 3.035644 -0.383302
C  -4.111283 -0.346698 -0.471921
C  0.246334 3.37222 1.167154
C  -2.514924 -2.194231 0.93147
C  -0.890737 3.875098 0.49056
C  -4.725183 -1.315069 0.354176
C  -3.916519 -2.241115 1.057583
H  2.246778 -2.345263 -1.167549
H  1.461882 -2.493999 0.42974
H  2.27802 1.412089 -0.923675
H  2.762158 0.044855 -1.978127
H  3.496952 -1.652587 1.578511
H  3.971651 -2.987335 0.468497
H  4.756491 0.937146 -0.842348
H  3.976095 0.764025 0.772053
H  6.01497 -0.846009 1.361721
H  6.592693 -0.552697 -0.317685
H  6.260864 -2.222128 0.228602
H  -2.77698 1.320312 -2.067753
H  -1.356968 0.243629 -2.209027
H  1.52385 1.63664 1.484192
H  -2.505995 3.417284 -0.89556
H  -4.731211 0.36709 -1.029222
H  0.800632 4.010485 1.863949
H  -1.874904 -2.912397 1.454548
H  -1.213585 4.909881 0.650735
H  -5.816583 -1.355116 0.439765
H  -4.380665 -3.00149 1.696247
