program: Gaussian 09
title: 000179926
version: EM64L-G09RevD.01
frameworkgroup: C1[X(C13H2Cl4F6N4O4)]
method: RPBEPBE
basis: SDD
operation: Freq
keyword: #p
keyword: freq=noraman
keyword: PBEPBE/SDD
title: #p freq=noraman PBEPBE/SDD
converged: NO YES NO NO
title: Mulliken charges:
elementType: Cl Cl Cl Cl F F F F F F O O O O N N N N C C C C C C C C C C C C C H H
charge: 0.125603 0.055743 0.083639 0.077384 -0.153261 -0.144990 -0.142371 -0.132500 -0.142279 -0.139332 -0.172026 -0.128890 -0.162005 -0.231048 -0.435931 -0.010099 0.022800 0.069728 0.292811 0.560503 0.244105 0.456790 -0.567583 -0.594446 0.255561 -0.471470 0.608504 0.271992 -0.155080 0.279042 -0.324733 0.373243 0.330594
chargesum: 0.00000
title: Mulliken charges with hydrogens summed into heavy atoms:
elementType: Cl Cl Cl Cl F F F F F F O O O O N N N N C C C C C C C C C C C C C
charge: 0.125603 0.055743 0.083639 0.077384 -0.153261 -0.144990 -0.142371 -0.132500 -0.142279 -0.139332 -0.172026 -0.128890 -0.162005 -0.231048 -0.062688 -0.010099 0.022800 0.069728 0.292811 0.560503 0.244105 0.456790 -0.567583 -0.263851 0.255561 -0.471470 0.608504 0.271992 -0.155080 0.279042 -0.324733
polarizability: 3.83740723e+02 2.49306323e+01 2.96390647e+02 -8.23206939e+00 -9.73541252e-01 1.37763738e+02
1716.lowfreq: -2.6891 0.0011 0.0017 0.0018 1.0426 3.2791 15.5928 21.8575 26.0862
frequency: 15.5715 21.8258 26.0766 34.7141 43.2332 53.7851 57.6063 62.8620 68.9430 90.5731 101.1940 114.8450 127.0013 137.2085 159.1681 177.5662 185.8362 200.6613 211.0239 218.2424 224.1884 228.4700 249.8094 270.5113 277.1887 282.2105 287.8562 297.5893 315.2459 320.8677 350.3537 353.0559 376.7192 381.8041 397.6849 433.2823 453.2967 458.2194 468.8357 475.5968 494.9644 512.6435 527.9696 576.0828 589.5715 612.3064 615.2348 625.6540 647.8197 650.0129 665.7223 679.1979 693.2054 709.3926 714.9179 738.7810 755.4618 759.8575 793.4703 803.1253 811.0201 881.6855 916.8010 953.7363 959.8739 1001.7097 1010.2226 1018.1873 1030.4239 1046.8958 1073.2585 1134.3594 1146.1337 1164.8504 1199.3496 1234.2519 1266.5502 1290.8266 1298.6048 1338.5206 1347.5833 1359.7876 1380.7106 1395.5077 1411.4751 1476.8634 1484.6902 1519.3762 1540.8321 1582.6253 1614.2579 3163.1900 3187.3577
redmass: 17.4836 18.5394 19.5354 22.5705 19.7391 16.1692 21.1085 22.4824 20.3918 16.3456 15.9556 14.0481 15.7173 17.2617 15.9456 19.9177 15.9980 13.7519 28.3316 21.1428 23.2182 15.7449 10.0356 12.0359 18.0134 17.5790 17.9911 14.2677 17.6882 25.9313 14.2611 12.7201 11.4660 11.2898 9.1503 8.9200 15.3576 15.0849 16.4099 13.5816 10.9987 11.3241 9.9167 10.5049 12.3344 12.8733 13.1295 15.8838 8.3873 7.6619 11.8874 9.9278 10.9774 8.1632 13.6159 8.4064 9.0045 10.2166 4.5334 1.9549 12.1401 11.0884 8.1928 1.5104 7.1094 13.0101 8.4182 9.2673 12.5005 12.4270 11.8841 8.0991 3.8385 5.2391 8.3962 4.5838 6.3028 5.1838 9.9057 9.1488 5.9785 6.4257 11.7931 7.6847 7.4239 7.5690 4.7080 8.7960 11.7752 2.2684 7.4693 1.0787 1.0918
irintensity: 0.0090 0.0167 0.1007 0.2794 0.0419 0.7631 0.3919 1.3484 0.5465 0.1704 0.9001 1.4638 1.0842 1.2947 1.1623 1.0511 2.9353 1.5367 0.0299 1.1344 0.1826 0.1655 2.2386 1.8118 3.5073 0.5468 1.4053 1.9288 1.4618 0.3873 1.0322 6.5212 8.5012 0.7788 4.9235 12.1756 19.5947 7.5353 2.0093 7.8358 5.0273 15.3804 2.9644 10.0727 9.6471 9.3391 23.4724 29.0137 12.0448 4.4110 48.9340 2.4764 19.2425 4.6367 2.0731 21.3246 5.8220 5.8903 37.9285 77.4387 46.9858 33.8716 10.7458 76.9085 10.0916 213.6364 188.8643 3.9510 109.0808 68.8114 228.3398 134.3133 262.7209 348.6354 136.6700 138.2203 407.0491 171.9245 37.9772 282.6386 22.9085 5.0685 40.0416 156.3316 232.3859 340.2930 45.3837 52.5910 41.9059 558.1106 200.7951 169.8280 27.9801
temp: 298.150 k
press: 1.00000 atm
elementType: 17 17 17 17 9 9 9 9 9 9 8 8 8 8 7 7 7 7 6 6 6 6 6 6 6 6 6 6 6 6 6 1 1
symmnumber: 1
zpe: 397265.7 jmol-1
zpe.correction: 0.151311 hartree
zpe.thermalcorrener: 0.179697 hartree
zpe.thermalcorrenthalpy: 0.180641 hartree
zpe.thermalcorrgfe: 0.088503 hartree
zpe.sumelectzpe: -3453.353027 hartree
zpe.sumelectthermal: -3453.324641 hartree
zpe.sumelectthermalent: -3453.323697 hartree
zpe.sumelectthermalfe: -3453.415835 hartree
dipole: 0.2758 0.5283 -0.5371
dipole: 0.8023
quadrupole: -223.1265 -214.5290 -204.8898
quadrupole: 2.8376 6.1899 5.0295
quadrupole: -8.9448 -0.3473 9.2920 2.8376 6.1899 5.0295
hfenergy: -3453.5043376 hartree
pointgroup: C01 [X(C13H2Cl4F6N4O4)]
dipole: -0.086876 0.3034285 0.0037272 debye
polarizability: 379.2358759|-33.7657109|223.8018835|8.6675765|-80.5058846|214.8573481 unknown
InChI: InChI=1S/C13H2Cl4F6N4O4/c14-5-2(12(18,19)20)1-3(26(28)29)8(9(5)27(30)31)24-11-7(16)4(13(21,22)23)6(15)10(17)25-11/h1,24H
charge 0 multiplicity 1
33 atoms
Cl -3.632664 -2.38446 0.959795
Cl 2.77494 0.916017 -2.39948
Cl 4.948772 -1.459074 2.292127
Cl 1.94141 -1.459785 3.448967
F  -5.991421 1.382532 0.090196
F  -6.006598 -0.836563 -0.348123
F  -5.598828 -0.094745 1.758318
F  5.41309 0.307546 -1.821475
F  6.110854 0.495216 0.305318
F  5.784141 -1.560741 -0.628193
O  -0.028294 -2.204812 -0.887068
O  -0.725147 -2.576315 1.254246
O  -2.441215 3.777127 -1.466772
O  -0.405384 2.899518 -1.977894
N  0.301435 0.707945 -0.775658
N  -0.724064 -1.910977 0.162233
N  -1.599102 2.808587 -1.442506
N  1.251436 -0.326215 1.125026
C  -1.040804 0.502042 -0.503337
C  -1.594057 -0.706811 0.049003
C  -1.993368 1.539791 -0.809847
C  -3.862393 0.243773 0.084585
C  -2.96876 -0.835363 0.340739
C  -3.359128 1.407318 -0.506059
C  1.415997 0.165604 -0.123955
C  2.707192 0.222475 -0.730276
C  3.830193 -0.261124 -0.011854
C  -5.340522 0.166535 0.394549
C  3.611737 -0.798628 1.295044
C  5.260561 -0.249222 -0.548308
C  2.290948 -0.806218 1.809031
H  0.459438 1.48605 -1.452877
H  -4.022092 2.245281 -0.7349
