program: Gaussian 09
title: 000179908
version: EM64L-G09RevD.01
frameworkgroup: C1[X(C7H15NO3)]
method: RPBEPBE
basis: SDD
operation: Freq
keyword: #p
keyword: freq=noraman
keyword: PBEPBE/SDD
title: #p freq=noraman PBEPBE/SDD
converged: YES YES NO NO
title: Mulliken charges:
elementType: O O O N C C C C C C C H H H H H H H H H H H H H H H
charge: -0.436359 -0.210447 -0.202643 0.146184 -0.372144 -0.375152 -0.367792 -0.379946 -0.398120 -0.368958 -0.327197 0.202690 0.200045 0.203154 0.199193 0.196996 0.192914 0.241557 0.219736 0.219711 0.187497 0.247770 0.252002 0.216393 0.182787 0.330129
chargesum: 0.00000
title: Mulliken charges with hydrogens summed into heavy atoms:
elementType: O O O N C C C C C C C
charge: -0.106230 -0.210447 -0.202643 0.146184 0.030591 0.027195 0.022119 0.081347 0.009087 0.130814 0.071984
polarizability: 1.23998415e+02 3.66526118e+00 8.89727736e+01 4.08798750e+00 4.56242063e+00 7.55979874e+01
1716.lowfreq: -22.9958 -0.0006 0.0006 0.0008 3.5441 4.9207 19.7002 26.8463 46.9489
frequency: 16.5423 25.1241 46.9417 52.1965 80.3043 104.8737 132.9300 138.1876 148.8142 193.0420 259.0523 314.7317 354.4900 409.5215 454.4754 488.1202 591.7671 679.0450 725.4932 742.2704 773.5778 827.1606 844.4837 906.7765 947.0063 994.6887 1006.6049 1011.3122 1053.8368 1066.2558 1077.7615 1081.2034 1107.4430 1133.5522 1201.7277 1215.4011 1232.7586 1246.7209 1259.4321 1276.7522 1281.9641 1294.1580 1297.0588 1299.9566 1325.4464 1343.5203 1356.6599 1359.5532 1381.3936 1426.5621 1449.8010 1460.9656 1462.4557 1465.7126 1474.1101 1482.8576 1488.1534 2944.9180 2954.9577 2957.5531 2959.9180 2968.8852 2993.7856 2996.0836 3006.7421 3025.6432 3027.8284 3042.3983 3065.6929 3072.3700 3117.8064 3558.6401
redmass: 3.5332 4.4695 2.7643 4.7466 2.3873 2.1956 3.6441 2.4169 2.1804 6.2657 3.8925 1.1661 4.0602 3.9772 3.2720 3.5041 5.5202 7.5707 1.0660 1.0888 1.1383 1.2155 9.0177 1.2615 4.7832 1.2571 4.2190 4.5091 3.3138 2.8746 2.1095 2.1301 1.8463 1.4209 1.5708 1.2999 3.7050 1.5173 1.3329 1.2123 1.0611 1.1584 1.1231 1.2261 1.3244 1.4004 1.5533 1.5851 1.2582 3.4612 1.1835 1.0748 1.0723 1.0733 1.0922 1.0951 1.0990 1.0689 1.0603 1.0596 1.0619 1.0599 1.0910 1.0678 1.0984 1.0610 1.0985 1.1015 1.1024 1.0979 1.1048 1.0661
irintensity: 0.2957 4.6094 5.8210 1.1491 1.0714 2.0915 2.2492 1.5423 0.7338 0.8661 6.1597 142.2029 30.0270 0.7159 1.6366 3.4958 15.3384 8.1876 13.5316 0.0826 4.8552 1.2086 10.6553 7.5114 69.5499 0.2050 3.7687 17.1593 15.3311 5.4343 4.0952 8.0547 24.4399 10.2677 19.7233 28.6056 49.1496 10.3259 12.3315 8.6032 1.1340 0.8081 1.1595 0.2683 14.3968 4.4272 5.2268 0.8928 25.5737 140.3537 12.6930 0.4211 0.2135 0.9029 0.3782 0.8921 27.4208 54.3423 5.0169 10.8869 5.0930 114.3164 10.9380 12.7875 4.7452 12.8764 8.5403 76.1300 32.5050 71.2492 12.0233 7.0298
temp: 298.150 k
press: 1.00000 atm
elementType: 8 8 8 7 6 6 6 6 6 6 6 1 1 1 1 1 1 1 1 1 1 1 1 1 1 1
symmnumber: 1
zpe: 577592.5 jmol-1
zpe.correction: 0.219993 hartree
zpe.thermalcorrener: 0.233669 hartree
zpe.thermalcorrenthalpy: 0.234613 hartree
zpe.thermalcorrgfe: 0.176005 hartree
zpe.sumelectzpe: -555.159271 hartree
zpe.sumelectthermal: -555.145595 hartree
zpe.sumelectthermalent: -555.144651 hartree
zpe.sumelectthermalfe: -555.203259 hartree
dipole: 2.3729 -0.8898 1.8510
dipole: 3.1383
quadrupole: -113.8615 -66.6249 -66.7622
quadrupole: 11.0637 2.9774 -0.7340
quadrupole: -31.4453 15.7913 15.6540 11.0637 2.9774 -0.7340
hfenergy: -555.3792639 hartree
pointgroup: C01 [X(C7H15N1O3)]
dipole: -0.935872 -0.3789448 0.7106458 debye
dipolederiv: -0.9482073 -0.1534921 -0.098472 -0.1846648 -0.2007808 0.1083001 -0.1452256 0.1217141 -0.5647908 -0.5150683 0.0532075 0.1253004 -0.1253167 -0.6531276 -0.1875765 0.0681344 -0.266319 -0.3833414 -0.6584851 -0.2835533 -0.0293485 -0.2041106 -0.5924804 -0.1680147 0.1646099 -0.0867017 -0.3040752 0.9184245 0.2427281 -0.2167281 0.3337934 0.9879653 0.3856403 -0.3858532 0.3941389 0.4274447 -0.020435 -0.00348 0.0076023 -0.0029203 0.1757191 -0.0110068 0.0445743 -0.0125547 0.0786985 -0.0538017 -0.0008527 -0.0189775 -0.0200043 0.1902279 -0.0065948 -0.0933179 -0.0069295 0.1016684 -0.0597769 -0.0089033 -0.0060649 -0.0095385 0.1815946 -0.0169502 -0.0167911 -0.0133072 0.0969104 0.0202229 -0.0102697 0.0223777 0.0362828 0.1279547 -0.0562802 0.08156 -0.0419696 0.0152995 -0.23071 -0.0246785 -0.004739 0.0175435 0.1652068 0.0223927 0.1134691 0.0051726 0.0268942 -0.0240721 -0.0149614 0.0888717 -0.0663594 0.1676942 -0.0406026 0.1186786 -0.0519312 0.147997 0.6732015 0.0606091 0.1486135 0.0827951 0.3043521 -0.0252414 0.0750963 -0.0362313 0.4620229 0.0400716 -0.0056204 0.001825 -0.0075652 -0.0495833 0.1324322 0.0015284 0.110284 -0.0651835 0.0370934 0.0120121 0.00545 0.0119659 -0.1095022 -0.121947 0.0037235 -0.0992126 -0.005634 0.0454799 -0.0009233 0.0034161 0.0033393 -0.1090006 -0.1220348 0.0081794 -0.0959873 -0.0035258 0.0377233 0.0007295 0.003952 0.0035482 -0.047791 0.1364733 -0.0003655 0.1110054 -0.072771 0.0441866 0.0040578 0.000556 0.0086291 -0.1107002 -0.1289695 0.0021198 -0.1044655 -0.0112234 0.0442486 0.0005391 -0.0006194 -0.0032051 -0.0560713 0.1418626 0.0007123 0.1155531 -0.0757143 0.0783954 0.0090549 -0.003281 0.0030998 -0.0504083 -0.0798218 -0.009948 -0.0647767 0.0345961 0.035141 -0.001049 -0.0095497 -0.0188257 -0.0273039 0.1174219 -0.0158351 0.0996517 -0.0433283 0.0553257 -0.0134669 0.0117685 -0.0025932 -0.0390805 0.1221551 0.0096283 0.107319 -0.0560275 0.0374951 0.0101576 -0.000614 -0.0164005 -0.1273028 -0.1370392 0.0004914 -0.1056262 -0.0097509 0.0616555 0.0204888 0.0101222 0.0577233 0.0054615 0.0986302 0.0131613 0.0554316 0.0022719 0.0171819 -0.0202798 0.0119012 -0.0036988 -0.0225344 -0.0788784 0.0158076 -0.0462788 0.0612514 0.0381202 0.0043136 -0.0151314 0.0137452 -0.088963 -0.1200493 -0.0037731 -0.0808072 0.0055769 -0.0268138 0.0037886 -0.0495216 -0.0016362 -0.0761488 0.1765672 -0.0169222 0.1217621 -0.1287151 0.3534029 0.1198438 0.0112904 0.0943737 0.054603 -0.1408684 -0.0334428 -0.128934 0.2634494 unknown
polarizability: 123.8280874|5.9315401|85.0899969|0.7843075|7.7182943|79.6510913 unknown
InChI: InChI=1S/C7H15NO3/c9-7-5-3-1-2-4-6-8(10)11/h9H,1-7H2
charge 0 multiplicity 1
26 atoms
O  -6.057518 -0.07521 -0.491868
O  4.254513 -1.06066 -0.726056
O  5.005301 0.93584 0.084955
N  4.119215 0.009277 -0.023604
C  -0.976511 -0.01253 -0.295178
C  0.267819 0.125965 0.61132
C  -2.305132 0.060067 0.490416
C  1.588593 0.025584 -0.185661
C  -3.549859 -0.069636 -0.417487
C  2.80723 0.184967 0.740166
C  -4.868869 -0.002254 0.373677
H  -0.961517 0.786063 -1.064963
H  -0.925523 -0.976014 -0.843095
H  0.223259 1.096548 1.146923
H  0.24302 -0.665176 1.389255
H  -2.35342 1.021678 1.042435
H  -2.320537 -0.741493 1.258547
H  1.652507 -0.952125 -0.697039
H  1.614675 0.808769 -0.967888
H  -3.551637 0.736684 -1.176597
H  -3.501291 -1.031571 -0.971877
H  2.810761 -0.595165 1.522921
H  2.863193 1.180259 1.207134
H  -4.966072 0.971864 0.883071
H  -4.893731 -0.801773 1.146965
H  -6.036267 -0.930958 -0.990667
