program: Gaussian 09
title: 000179897
version: EM64L-G09RevD.01
frameworkgroup: C1[X(C6H6N4)]
method: RPBEPBE
basis: SDD
operation: Freq
keyword: #p
keyword: freq=noraman
keyword: PBEPBE/SDD
title: #p freq=noraman PBEPBE/SDD
converged: YES YES NO YES
title: Mulliken charges:
elementType: N N N N C C C C C C H H H H H H
charge: -0.469939 -0.057873 0.034886 -0.606003 0.319886 -0.164634 0.119992 -0.310442 -0.158317 -0.367813 0.302207 0.233878 0.223589 0.236498 0.314615 0.349471
chargesum: 0.00000
title: Mulliken charges with hydrogens summed into heavy atoms:
elementType: N N N N C C C C C C
charge: -0.167732 -0.057873 0.034886 0.058084 0.319886 -0.164634 0.119992 -0.076565 0.065272 -0.131315
polarizability: 1.48813408e+02 5.41184928e-01 8.72397220e+01 -3.00878304e-03 3.56405024e-03 3.71836668e+01
1716.lowfreq: -12.7400 -9.7092 0.0006 0.0007 0.0008 3.3341 142.3869 164.6256 233.5978
frequency: 142.3856 164.6224 233.5975 289.6972 338.9033 430.1003 456.0454 494.2698 514.8081 521.4426 587.2285 624.3046 664.8153 689.9897 775.5981 792.5158 824.1753 878.5204 904.0754 950.0615 954.5890 1024.5367 1050.7031 1102.7252 1190.0346 1240.3956 1272.5221 1308.4283 1381.0974 1390.7681 1402.1022 1450.3171 1539.3292 1578.5861 1623.4252 1651.6147 3130.7697 3140.4968 3169.1205 3573.5834 3584.2680 3721.3684
redmass: 5.5608 1.1105 4.0850 3.3830 4.5867 3.7256 1.2049 4.9243 4.7985 1.2076 3.6427 7.8442 6.7019 7.5692 1.5285 3.9935 5.7933 5.9582 1.3659 1.3582 3.1871 2.3560 2.2657 1.6192 2.3807 1.3553 6.0662 1.9877 2.7608 3.2833 6.2285 2.3447 5.9495 1.7720 3.3956 3.3909 1.0876 1.0922 1.0991 1.0460 1.0803 1.1050
irintensity: 1.8848 89.0673 12.1580 6.6366 1.7076 8.5161 252.1036 2.8634 2.5130 122.9553 1.5350 0.4244 3.6026 0.0931 77.1789 12.2539 3.6391 6.0368 0.3012 2.2210 1.5756 2.6221 1.3738 6.6789 3.0030 1.0529 79.8924 11.7069 12.9421 132.4686 85.5324 30.4417 98.9559 45.6080 106.6696 498.9403 9.5605 20.5920 25.6910 130.8577 26.2270 46.7461
temp: 298.150 k
press: 1.00000 atm
elementType: 7 7 7 7 6 6 6 6 6 6 1 1 1 1 1 1
symmnumber: 1
zpe: 315562.5 jmol-1
zpe.correction: 0.120191 hartree
zpe.thermalcorrener: 0.127989 hartree
zpe.thermalcorrenthalpy: 0.128933 hartree
zpe.thermalcorrgfe: 0.088021 hartree
zpe.sumelectzpe: -450.546700 hartree
zpe.sumelectthermal: -450.538903 hartree
zpe.sumelectthermalent: -450.537959 hartree
zpe.sumelectthermalfe: -450.578871 hartree
dipole: 3.5543 6.2716 0.0160
dipole: 7.2088
quadrupole: -35.9265 -58.1591 -61.9466
quadrupole: 2.7372 0.0540 0.0061
quadrupole: 16.0842 -6.1484 -9.9359 2.7372 0.0540 0.0061
hfenergy: -450.6668918 hartree
pointgroup: C01 [X(C6H6N4)]
dipole: 1.3661837 -2.4853929 -0.0078296 debye
dipolederiv: -0.798128 -0.0438248 -0.0004109 -0.0825794 -0.5160236 0.0009224 -0.0009304 0.0018791 -0.3097114 -1.3028368 0.1038553 0.0000191 0.3799609 -0.4659624 0.0001505 0.0006496 -0.000011 -0.3032388 -0.3825806 -0.0678197 -0.0000842 0.1251833 -0.3054009 -0.0001041 0.000044 0.0000804 -0.234823 -1.8227726 -0.0030108 -0.0013043 0.0502771 -0.2017266 0.0003655 -0.0055377 0.0007918 -0.7513052 0.2992178 -0.1451647 0.0004187 -0.7623353 -0.1595219 -0.0004234 -0.000326 -0.0007963 0.1133882 1.057708 -0.0034126 -0.0000064 0.5621503 0.1320384 0.0000841 0.0002899 0.0001405 0.0533213 2.1295848 0.0320325 0.0003494 -0.2775307 0.855213 -0.0003414 0.0008085 -0.0004266 0.2118586 0.3114579 0.0595312 -0.0000825 -0.0304089 0.1304848 0.0000896 -0.000149 -0.0000557 -0.1733822 -0.2254404 -0.0061119 0.0000124 0.3210276 -0.1547846 -0.0000171 0.0001233 0.0001442 -0.1554335 0.1987442 0.0366388 0.0001179 -0.3355175 0.2598213 0.0002677 0.0001053 0.0000816 -0.1189287 0.1301546 -0.0024363 0.0001672 0.0050721 0.1148561 -0.0004534 0.0005742 -0.0011342 0.3678301 0.0877302 0.007934 0.0000157 -0.0200008 -0.1073 -0.0001 0.0000826 -0.000008 0.1704889 -0.0924588 -0.0764284 -0.0000224 -0.0864992 0.0565724 -0.0000727 -0.0000546 -0.0001044 0.1737798 -0.1017549 0.0820791 0.0000289 0.1081034 0.0333114 -0.0000485 -0.0001268 -0.0000245 0.1409381 0.2447909 -0.0111975 0.0004176 -0.0564681 0.1361487 -0.0005137 0.0024074 -0.0010497 0.4120268 0.2665836 0.0373358 0.0003638 0.0995651 0.1922738 0.0001945 0.0020398 0.0004929 0.4031909 unknown
polarizability: 148.7889569|-1.3408117|87.2641529|-0.0102922|0.0315636|37.1836871 unknown
InChI: InChI=1S/C6H6N4/c7-6-9-4-2-1-3-8-5(4)10-6/h1-3,9H,7H2
charge 0 multiplicity 1
16 atoms
N  1.208243 -1.187669 0.000568
N  1.242544 1.113515 0.001225
N  -1.205767 1.441389 0.001574
N  3.357593 -0.034669 0.00068
C  -0.138624 -0.783875 0.00015
C  -0.093658 0.661662 0.001111
C  1.981872 -0.009906 0.000475
C  -1.362732 -1.467298 -0.000143
C  -2.520986 -0.64833 0.00039
C  -2.394526 0.76658 0.001373
H  1.550709 -2.146747 -0.002429
H  -1.434829 -2.560131 -0.00041
H  -3.51862 -1.097913 0.000164
H  -3.292417 1.395079 0.001498
H  3.895692 -0.89476 -0.002726
H  3.836807 0.861474 -0.002099
