program: Gaussian 09
title: 000179916
version: EM64L-G09RevD.01
frameworkgroup: C1[X(C14H5Cl2F6N3O4)]
method: RPBEPBE
basis: SDD
operation: Freq
keyword: #p
keyword: freq=noraman
keyword: PBEPBE/SDD
title: #p freq=noraman PBEPBE/SDD
converged: YES YES NO NO
title: Mulliken charges:
elementType: Cl Cl F F F F F F O O O O N N N C C C C C C C C C C C C C C H H H H H
charge: 0.102892 -0.004319 -0.154261 -0.149219 -0.146066 -0.146790 -0.155423 -0.155900 -0.152934 -0.124715 -0.170987 -0.237115 -0.480704 -0.032506 0.024700 0.265242 0.557882 0.277057 0.221725 0.461157 -0.547350 -0.615069 0.219210 -0.303551 0.266184 -0.310873 0.246993 -0.187046 -0.116657 0.367175 0.328757 0.282276 0.297035 0.273201
chargesum: 0.00000
title: Mulliken charges with hydrogens summed into heavy atoms:
elementType: Cl Cl F F F F F F O O O O N N N C C C C C C C C C C C C C C
charge: 0.102892 -0.004319 -0.154261 -0.149219 -0.146066 -0.146790 -0.155423 -0.155900 -0.152934 -0.124715 -0.170987 -0.237115 -0.113529 -0.032506 0.024700 0.265242 0.557882 0.277057 0.221725 0.461157 -0.547350 -0.286313 0.219210 -0.021275 0.266184 -0.013839 0.246993 0.086155 -0.116657
polarizability: 3.12469196e+02 -3.11220697e+01 2.24661383e+02 -9.75216282e+00 -1.14955190e+01 1.51072427e+02
1716.lowfreq: -3.8365 -0.8250 0.0007 0.0015 0.0019 3.3968 9.8374 22.5079 30.4195
frequency: 9.4896 22.3986 30.4034 42.0019 47.4548 50.0029 63.0178 71.4863 82.4080 111.4985 117.2062 123.9256 137.0858 138.9729 155.5853 169.8522 186.6046 197.4175 241.2782 255.5592 256.2396 279.5958 287.3525 310.8820 314.3407 331.0005 335.3492 357.0413 382.9829 396.4202 419.1818 425.1856 435.7275 443.1178 468.5990 494.8075 506.4252 538.5555 558.1434 570.1191 590.6670 602.8921 605.1773 616.4951 645.6609 648.0988 682.4121 687.9780 703.3507 715.6065 728.7072 736.0790 754.9327 803.4744 820.6088 836.4777 853.9759 896.0634 898.8306 928.4582 954.8431 969.8752 981.8830 1004.0790 1006.0573 1025.7721 1030.9722 1076.4712 1094.1197 1129.7678 1141.8519 1155.5572 1199.1211 1221.4309 1252.4931 1269.1404 1275.4035 1301.8806 1338.1849 1366.1732 1368.7708 1391.5811 1401.9747 1420.4412 1475.5400 1492.3177 1504.3480 1575.0000 1581.4556 1604.2999 1623.7644 3124.5509 3168.3865 3185.0038 3186.2560 3187.1378
redmass: 13.6858 15.8825 15.6324 16.5362 15.6556 18.5345 18.5035 15.7754 15.0785 12.5493 6.7184 10.8864 15.7406 13.3583 14.9437 14.7126 12.8346 19.8241 10.4519 10.2593 10.6722 12.3039 17.1121 12.8542 16.2010 8.2404 8.7345 9.7585 14.1416 6.3516 9.3103 5.9546 9.9876 8.8417 10.8115 10.5097 7.1514 7.8916 7.2264 10.4241 6.4659 8.3627 9.9205 11.5294 8.1826 7.8982 8.2765 11.2193 9.8112 9.2066 5.9903 8.6985 7.1480 3.1074 2.0178 1.6428 4.0235 5.3357 1.4790 8.2263 1.4993 1.4181 8.2382 7.0465 6.4787 8.7598 12.4911 11.9568 2.3785 1.7279 3.2062 5.1292 2.8176 8.0688 3.2358 1.5217 3.4279 2.9363 11.8779 7.1845 4.3996 13.5409 4.3352 9.8808 3.0264 3.2433 8.7036 8.4742 2.3329 6.2391 9.1000 1.0781 1.0897 1.0951 1.0915 1.0959
irintensity: 0.1710 0.1801 0.0480 0.1436 0.0388 0.2503 1.6331 0.2449 0.0422 2.9490 0.0800 0.3482 1.1579 2.0085 1.0601 10.1187 0.6393 0.4815 1.8910 0.8939 0.3773 2.7154 0.2245 0.0711 0.7708 1.1715 3.8579 15.7502 0.0265 3.2620 8.7590 13.5156 0.6003 1.8792 0.9319 7.3771 21.6851 2.5382 0.0867 7.8807 2.7666 27.9812 32.2983 9.5991 7.0291 3.8583 4.7993 25.7500 2.2330 5.9157 0.8311 1.8735 39.2397 38.2385 55.8715 51.2550 15.4447 22.7563 33.2675 26.1051 82.7678 5.4449 137.3255 125.1930 140.3600 131.0602 119.8260 159.8241 84.3297 14.4461 141.2168 330.4537 124.1104 104.5552 102.4300 106.7812 147.0893 62.8898 326.7068 12.2258 41.9704 118.6132 63.9642 8.8298 73.9217 57.0815 175.0454 1.9924 237.2733 24.4472 339.1731 265.7295 1.2489 1.9046 25.4354 2.1407
temp: 298.150 k
press: 1.00000 atm
elementType: 17 17 9 9 9 9 9 9 8 8 8 8 7 7 7 6 6 6 6 6 6 6 6 6 6 6 6 6 6 1 1 1 1 1
symmnumber: 1
zpe: 479741.8 jmol-1
zpe.correction: 0.182724 hartree
zpe.thermalcorrener: 0.208876 hartree
zpe.thermalcorrenthalpy: 0.209820 hartree
zpe.thermalcorrgfe: 0.122630 hartree
zpe.sumelectzpe: -2518.562268 hartree
zpe.sumelectthermal: -2518.536116 hartree
zpe.sumelectthermalent: -2518.535172 hartree
zpe.sumelectthermalfe: -2518.622362 hartree
dipole: 3.3761 -0.7832 -2.5818
dipole: 4.3217
quadrupole: -182.9053 -196.9857 -175.5232
quadrupole: 0.8980 -4.2698 1.7807
quadrupole: 2.2328 -11.8476 9.6149 0.8980 -4.2698 1.7807
hfenergy: -2518.744992 hartree
pointgroup: C01 [X(C14H5Cl2F6N3O4)]
dipole: 1.1577015 -0.1087483 1.2405002 debye
polarizability: 294.4064346|26.9659205|221.1326807|44.1010414|36.003663|172.6638905 unknown
InChI: InChI=1S/C14H5Cl2F6N3O4/c15-5-1-2-8(6(3-5)13(17,18)19)23-11-9(24(26)27)4-7(14(20,21)22)10(16)12(11)25(28)29/h1-4,23H
charge 0 multiplicity 1
34 atoms
Cl -2.912402 2.476965 0.80984
Cl 5.826513 2.006056 1.948867
F  -5.26168 -0.761556 -1.393235
F  -5.400906 0.55852 0.440579
F  -4.735808 1.435421 -1.542196
F  3.244448 1.007438 -2.50922
F  2.36884 -1.053941 -2.160105
F  1.071066 0.786848 -1.913125
O  -0.071083 1.21601 2.616214
O  0.354704 2.461446 0.748126
O  -1.823979 -3.773031 -1.450649
O  0.246258 -3.447338 -0.572047
N  0.875741 -1.131882 0.406079
N  -0.173518 1.464145 1.356233
N  -0.968491 -3.029364 -0.846897
C  -0.430623 -0.764082 0.195345
C  -0.996077 0.503369 0.565592
C  -1.359286 -1.675301 -0.441294
C  2.010072 -0.31998 0.776204
C  -3.189759 -0.046642 -0.383235
C  -2.32001 0.862873 0.282564
C  -2.689403 -1.308711 -0.720459
C  2.77635 0.352218 -0.219187
C  2.443368 -0.294912 2.118627
C  -4.620169 0.295708 -0.712483
C  3.938351 1.066606 0.139994
C  2.37748 0.282635 -1.672137
C  3.606614 0.412939 2.487253
C  4.334306 1.089513 1.490231
H  1.053663 -2.118203 0.107643
H  -3.327626 -2.041401 -1.220423
H  1.85624 -0.82032 2.876368
H  4.521925 1.587854 -0.622489
H  3.933183 0.441203 3.530124
