program: Gaussian 09
title: 000016082
version: EM64L-G09RevD.01
frameworkgroup: C1[X(C10H9ClN4)]
method: RPBEPBE
basis: SDD
operation: Freq
keyword: #p
keyword: freq=noraman
keyword: PBEPBE/SDD
title: #p freq=noraman PBEPBE/SDD
converged: NO YES NO NO
title: Mulliken charges:
elementType: Cl N N N N C C C C C C C C C C H H H H H H H H H
charge: -0.008856 -0.089162 -0.324090 0.006333 0.013168 0.288946 0.037629 -0.345132 -0.338389 0.053939 -0.228696 -0.229766 -0.223810 -0.318431 -0.603409 0.270202 0.283940 0.229753 0.232383 0.231795 0.340219 0.251315 0.218360 0.251758
chargesum: 0.00000
title: Mulliken charges with hydrogens summed into heavy atoms:
elementType: Cl N N N N C C C C C C C C C C
charge: -0.008856 -0.089162 0.016128 0.006333 0.013168 0.288946 0.037629 -0.074930 -0.054448 0.053939 0.001056 0.002618 0.007985 -0.318431 0.118024
polarizability: 2.26071891e+02 -3.20620628e+00 1.81367652e+02 -1.44248320e-02 5.66089710e-02 6.00059142e+01
1716.lowfreq: -6.1977 -2.7099 -0.0010 0.0002 0.0018 6.5711 43.1014 70.1316 78.9517
frequency: 43.1006 70.0872 78.9491 97.9267 103.1782 163.0793 165.8590 220.4577 226.3931 254.3044 317.1723 350.8535 404.3836 456.3146 462.0507 512.7524 574.2833 613.7961 619.8635 646.6552 657.0518 689.3621 704.5958 777.6277 804.7188 823.1520 866.2380 881.0434 908.7105 960.0902 989.9624 1000.7920 1011.5622 1020.7243 1070.0951 1076.5148 1117.9885 1124.9663 1138.8090 1173.0696 1180.7709 1198.9389 1236.1309 1312.6213 1334.8342 1385.4777 1393.6805 1422.5673 1436.1834 1453.6825 1459.5878 1487.9740 1490.3604 1501.2702 1584.5098 1588.6566 1613.8867 2992.9831 3074.3713 3113.8627 3128.9493 3142.3806 3156.5421 3169.1997 3175.7928 3574.0170
redmass: 3.7637 1.0789 5.4827 4.9486 3.9646 4.6405 11.3454 6.4814 4.6037 5.2941 8.7419 7.6980 2.8567 3.6306 7.5032 7.1977 1.1710 6.3919 6.8608 7.5139 6.2525 5.3217 1.7739 2.7421 9.7112 4.6103 1.2450 7.2349 7.3106 1.4287 6.2582 1.3747 1.3331 2.4399 2.3320 1.5994 4.8369 1.2839 2.9563 1.0607 1.1540 3.1208 6.6408 1.3880 2.9960 6.7033 5.7120 2.1920 1.4933 2.4193 1.0404 1.3091 2.2552 2.6560 5.2687 6.2599 6.2597 1.0344 1.1015 1.1012 1.0855 1.0895 1.0943 1.0952 1.0990 1.0776
irintensity: 0.3686 0.0082 2.6886 1.1733 0.9198 0.5052 1.6089 0.6867 0.0377 0.9642 4.9000 12.9286 0.0016 2.8454 1.8015 4.7210 106.6969 1.5339 15.9016 9.4481 15.7704 12.5903 48.3651 70.4375 82.5026 0.0064 0.0388 0.8239 17.5044 4.3318 1.3833 0.0049 0.6786 9.3551 36.0875 7.7620 9.7548 1.6492 105.4937 0.8141 32.3610 63.6099 70.9220 13.9480 99.2908 307.3915 261.1840 38.0235 99.6628 176.7706 15.4204 55.5589 113.8434 416.9808 548.5219 100.3478 23.5765 46.8885 25.3678 25.4572 0.1218 14.6839 22.2652 10.0794 18.6637 96.6141
temp: 298.150 k
press: 1.00000 atm
elementType: 17 7 7 7 7 6 6 6 6 6 6 6 6 6 6 1 1 1 1 1 1 1 1 1
symmnumber: 1
zpe: 465274.2 jmol-1
zpe.correction: 0.177214 hartree
zpe.thermalcorrener: 0.190332 hartree
zpe.thermalcorrenthalpy: 0.191276 hartree
zpe.thermalcorrgfe: 0.136084 hartree
zpe.sumelectzpe: -1064.483496 hartree
zpe.sumelectthermal: -1064.470377 hartree
zpe.sumelectthermalent: -1064.469433 hartree
zpe.sumelectthermalfe: -1064.524626 hartree
dipole: 1.1948 4.6856 -0.0048
dipole: 4.8356
quadrupole: -82.2051 -82.1929 -97.0607
quadrupole: -13.5361 -0.0009 -0.0032
quadrupole: 4.9478 4.9600 -9.9078 -13.5361 -0.0009 -0.0032
hfenergy: -1064.6607093 hartree
pointgroup: C01 [X(C10H9Cl1N4)]
dipole: -0.2052539 1.8856549 -0.1466529 debye
dipolederiv: -0.3298934 0.3525508 -0.0322414 0.444633 -0.8970565 0.071244 -0.0384549 0.0680364 -0.0975805 -1.6384316 -0.6006728 0.0115173 -0.3241655 -0.7300193 0.0351205 -0.0087263 0.0281506 -0.1802335 -0.825304 -0.6697873 0.0428358 -0.5992952 -1.1235928 0.0364689 0.0343896 0.0305269 -0.4739821 -1.7013965 0.5730671 -0.0803991 0.5951187 -0.9772953 0.0792742 -0.0827482 0.0784814 -0.1293036 -0.7928152 -0.1521044 -0.0031068 -0.2986929 -1.5488133 0.0969201 0.0083061 0.1017727 -0.1838074 -0.7455044 0.0476809 -0.0200558 0.1011569 -0.0524616 0.0037549 -0.0239681 0.0028535 -0.0342294 2.1176045 -0.0032083 0.0467154 -0.2201954 0.9778025 -0.0727294 0.0623351 -0.0672632 0.1049649 0.1235649 0.0912519 -0.0017562 -0.207554 -0.006768 -0.0133254 0.0215838 -0.0065951 -0.1151412 0.121267 -0.1174036 0.0144106 0.1729148 -0.0094017 -0.003935 -0.0079829 -0.0106476 -0.1087969 1.5504733 0.8471373 -0.0330433 0.7406726 1.5468979 -0.0829403 -0.0236829 -0.0796203 0.235603 -0.2340706 -0.1351742 0.0087396 -0.2278562 0.1000088 -0.0252097 0.0159292 -0.0230217 -0.1568837 -0.1112474 0.1857517 -0.0134196 0.2686043 0.0265001 -0.0081928 -0.0197256 -0.0100237 -0.157574 0.1133227 -0.0112596 0.0064785 0.0127672 0.0277997 -0.0125678 0.0045326 -0.0131437 -0.1366629 1.7193863 -0.4451204 0.0726204 -0.4659725 1.9924167 -0.1566996 0.0737073 -0.1555924 0.0773212 0.1680401 -0.0867366 0.0062377 0.1178334 0.5758335 -0.0252734 -0.0084981 -0.0284659 0.2305136 0.1114754 -0.0862102 0.0059583 -0.075798 0.0147767 0.0085436 0.0052504 0.0082779 0.1459492 0.1515074 0.058299 -0.0045752 0.0470331 0.0142662 0.0119387 -0.0037547 0.0121597 0.1520464 0.026533 0.0701663 -0.0084088 0.1048729 -0.0854539 0.0212152 -0.0110636 0.0203792 0.1557164 -0.0132443 -0.0877633 0.0029102 -0.1185452 -0.0416831 0.0128334 0.0052668 0.0135668 0.157235 -0.1389398 0.0233152 -0.0084887 0.0254863 0.092656 0.0056222 -0.008582 0.0055398 0.1571168 0.2764372 0.0893506 -0.0083106 0.0259954 0.111711 0.0175393 -0.0030841 0.019192 0.3359916 0.0778135 0.1008009 -0.1034368 -0.0225468 0.0073074 -0.0022179 -0.0695212 0.0611472 -0.0648213 -0.0930638 -0.1623388 0.00457 -0.0860483 -0.016221 0.0082297 -0.0012437 0.0057245 0.1292301 0.0664855 0.1184079 0.0942486 -0.0104186 0.0007901 -0.0056132 0.0797354 -0.061435 -0.0426714 unknown
polarizability: 225.9900442|-2.8648288|180.641448|4.0422648|-9.3202893|60.8139645 unknown
InChI: InChI=1S/C10H9ClN4/c1-12-10-14-8(13-9(11)15-10)7-5-3-2-4-6-7/h2-6,12H,1H3
charge 0 multiplicity 1
24 atoms
Cl 2.639044 -3.232474 0.39227
N  0.861155 0.908986 0.034184
N  3.058852 1.763679 0.023272
N  0.584074 -1.495476 0.213121
N  2.815443 -0.555895 0.194221
C  -1.391644 -0.054028 0.056757
C  0.079267 -0.211191 0.102072
C  -1.971444 1.23835 -0.05665
C  -2.231317 -1.198217 0.126902
C  2.215819 0.694402 0.082452
C  -3.372629 1.382418 -0.099417
C  -3.632187 -1.048938 0.083509
C  -4.206826 0.240053 -0.029568
C  1.93075 -1.562279 0.251244
C  2.599066 3.15153 -0.093069
H  -1.307972 2.10662 -0.109366
H  -1.764524 -2.183704 0.214502
H  -3.816795 2.380011 -0.186709
H  -4.276506 -1.933071 0.137524
H  -5.296303 0.353946 -0.062831
H  4.054795 1.543399 0.064356
H  2.014341 3.299543 -1.01815
H  3.478229 3.815293 -0.111793
H  1.954912 3.428145 0.760068
