program: Gaussian 09
title: 000179917
version: EM64L-G09RevD.01
frameworkgroup: C1[X(C14H3Br3ClF6N3O4)]
method: RPBEPBE
basis: SDD
operation: Freq
keyword: #p
keyword: freq=noraman
keyword: PBEPBE/SDD
title: #p freq=noraman PBEPBE/SDD
converged: YES YES NO NO
title: Mulliken charges:
elementType: Br Br Br Cl F F F F F F O O O O N N N C C C C C C C C C C C C C C H H H
charge: 0.139626 0.108420 0.116817 0.112128 -0.153494 -0.146084 -0.146280 -0.136171 -0.146485 -0.139951 -0.138434 -0.132522 -0.168408 -0.235747 -0.466520 -0.025111 0.024363 0.239928 0.557872 0.285807 0.585137 0.458567 -0.550497 -0.611357 -0.490845 0.504544 -0.381180 -0.462752 -0.114441 0.265070 0.249353 0.379266 0.329630 0.289751
chargesum: 0.00000
title: Mulliken charges with hydrogens summed into heavy atoms:
elementType: Br Br Br Cl F F F F F F O O O O N N N C C C C C C C C C C C C C C
charge: 0.139626 0.108420 0.116817 0.112128 -0.153494 -0.146084 -0.146280 -0.136171 -0.146485 -0.139951 -0.138434 -0.132522 -0.168408 -0.235747 -0.087254 -0.025111 0.024363 0.239928 0.557872 0.285807 0.585137 0.458567 -0.550497 -0.281727 -0.490845 0.504544 -0.381180 -0.462752 0.175310 0.265070 0.249353
polarizability: 3.80591659e+02 2.32167924e+01 2.61554595e+02 2.59930393e+01 1.88043286e+01 2.01534665e+02
1716.lowfreq: -0.0008 0.0007 0.0009 1.0285 2.0726 4.6255 14.5946 19.1109 20.2812
frequency: 14.5448 19.0984 20.2492 26.8636 42.7705 46.1483 53.5308 60.3467 71.4275 78.9136 83.8039 104.5440 114.5025 124.5007 130.7579 138.0797 152.3254 167.4040 169.5542 188.6632 196.1622 202.8725 214.1335 222.8333 247.7156 259.9149 263.7685 286.4898 297.2421 310.7445 318.7124 350.1796 382.7283 385.3977 398.5558 418.0336 430.4757 442.9522 473.6976 488.3469 489.4894 501.0629 530.7311 544.1018 569.0192 580.0981 602.4899 615.7468 634.6053 646.0093 652.7832 674.8615 689.1300 704.3716 712.0124 718.0849 736.2920 742.5822 753.0368 805.7981 810.2635 870.2999 874.9036 897.9943 933.7196 954.8332 987.4847 1005.7708 1010.4849 1030.9715 1058.6002 1075.6749 1106.3953 1142.1045 1158.7934 1207.9259 1222.7436 1228.5282 1266.3217 1298.8486 1317.0694 1323.3349 1339.2131 1367.9578 1386.9023 1413.6185 1419.4227 1487.8119 1498.2911 1521.0442 1554.4053 1576.8052 1618.8827 3142.9800 3185.4940 3190.7441
redmass: 20.4688 35.5541 19.4397 23.2145 18.7623 18.8267 20.8587 21.2154 22.2128 15.9487 16.8440 20.3806 14.8205 12.3550 26.0896 13.9282 28.4641 17.1365 23.2162 12.2204 9.4893 21.5005 22.6659 56.8516 10.5893 15.6688 14.0796 17.0456 11.0290 15.0980 11.0826 11.9677 13.3856 13.5479 6.9833 11.8577 10.2641 10.0670 13.8453 14.4142 12.3325 12.5700 5.3830 6.6916 10.5670 10.4904 10.9255 9.0875 11.0009 8.3953 12.4737 10.5873 11.6933 9.8223 12.7729 8.4877 8.4743 8.3560 8.2865 1.3665 10.1592 1.4325 11.2018 7.1436 8.9960 1.4893 12.8556 7.5379 8.3898 12.6478 11.2925 12.1918 5.8614 3.4562 4.6757 4.5136 2.5429 5.7695 3.8292 3.4059 6.9577 10.6342 11.5927 3.9931 13.1368 8.1826 4.3825 3.2998 8.7566 10.0656 9.3609 2.3874 8.9879 1.0784 1.0916 1.0934
irintensity: 0.1381 0.0052 0.1198 0.1640 0.4509 0.1321 0.2433 1.1623 0.6440 0.0331 0.4354 0.1760 2.0926 0.4370 0.4157 1.5771 0.2930 3.7521 2.8175 0.3790 0.5774 0.3002 0.1765 0.2540 1.8045 1.4481 2.6881 0.1522 0.7652 2.2132 4.3247 16.3728 0.4904 0.5067 2.4757 12.6030 3.8558 16.7451 6.8311 1.7331 4.6499 8.6302 11.8095 1.9610 7.9853 0.9069 44.3843 9.3067 25.7139 2.3296 3.8259 1.0023 24.0634 10.0026 8.0908 8.8910 6.7232 9.0718 6.1379 79.3835 26.0772 13.9295 24.6271 14.0819 28.9776 77.2661 198.0968 136.7911 139.3094 111.6054 4.8786 207.2030 195.3907 158.9903 322.9921 189.4145 39.5666 157.2284 159.9049 73.5628 22.8876 13.8071 418.1911 48.4814 92.0921 44.9112 99.3981 45.7422 139.1699 119.9667 57.9274 321.0985 349.3474 232.3283 26.9342 2.6204
temp: 298.150 k
press: 1.00000 atm
elementType: 35 35 35 17 9 9 9 9 9 9 8 8 8 8 7 7 7 6 6 6 6 6 6 6 6 6 6 6 6 6 6 1 1 1
symmnumber: 1
zpe: 423405.9 jmol-1
zpe.correction: 0.161267 hartree
zpe.thermalcorrener: 0.190806 hartree
zpe.thermalcorrenthalpy: 0.191750 hartree
zpe.thermalcorrgfe: 0.095233 hartree
zpe.sumelectzpe: -2097.511109 hartree
zpe.sumelectthermal: -2097.481570 hartree
zpe.sumelectthermalent: -2097.480626 hartree
zpe.sumelectthermalfe: -2097.577143 hartree
dipole: -0.2677 -1.8058 1.9620
dipole: 2.6799
quadrupole: -231.8065 -212.5571 -218.0249
quadrupole: 8.4038 -7.1564 -9.6232
quadrupole: -11.0103 8.2390 2.7713 8.4038 -7.1564 -9.6232
hfenergy: -2097.6723754 hartree
pointgroup: C01 [X(C14H3Br3Cl1F6N3O4)]
dipole: -0.0460524 0.2287285 1.0282101 debye
polarizability: 368.2290252|48.3853528|248.8376166|-12.7885526|-39.6066596|226.6142769 unknown
InChI: InChI=1S/C14H3Br3ClF6N3O4/c15-4-2-5(16)10(8(17)7(4)14(22,23)24)25-11-6(26(28)29)1-3(13(19,20)21)9(18)12(11)27(30)31/h1-2,25H
charge 0 multiplicity 1
34 atoms
Br -2.454717 0.619362 -2.282824
Br -0.152303 0.677862 3.009742
Br -5.177552 -1.843772 2.432833
Cl 3.218131 -2.669562 0.070371
F  5.998856 0.892632 -0.513642
F  5.667444 -0.860301 0.880031
F  5.57077 -1.159584 -1.366677
F  -6.062207 -1.388549 -0.242333
F  -5.412262 0.402502 -1.423614
F  -4.56664 -1.661756 -1.895245
O  -0.301476 -1.9072 -1.069482
O  0.282133 -2.350996 1.09612
O  2.641954 3.984819 -0.808914
O  0.415956 3.522157 -0.807861
N  -0.385934 1.146902 -0.142182
N  0.384549 -1.691933 -0.000857
N  1.671303 3.150068 -0.707575
C  0.930449 0.759556 -0.225681
C  1.389956 -0.594286 -0.075154
C  1.970038 1.732448 -0.47883
C  -1.490327 0.432078 0.405466
C  3.745658 0.054039 -0.300088
C  2.74952 -0.943136 -0.097574
C  3.330428 1.374856 -0.504897
C  -2.613863 0.119193 -0.410696
C  -3.775574 -0.530072 0.111092
C  -1.560455 0.124328 1.789825
C  -3.762593 -0.883634 1.492152
C  -2.669914 -0.547799 2.32006
C  5.219001 -0.268677 -0.324553
C  -4.939438 -0.800646 -0.833293
H  -0.527051 2.136471 -0.446009
H  4.064354 2.165313 -0.68091
H  -2.696191 -0.803488 3.380695
