program: Gaussian 09
title: 000179841
version: EM64L-G09RevD.01
frameworkgroup: C1[X(C13H14F3N)]
method: RPBEPBE
basis: SDD
operation: Freq
keyword: #p
keyword: freq=noraman
keyword: PBEPBE/SDD
title: #p freq=noraman PBEPBE/SDD
converged: NO YES NO NO
title: Mulliken charges:
elementType: F F F N C C C C C C C C C C C C C H H H H H H H H H H H H H H
charge: -0.165814 -0.162009 -0.164591 -0.080721 -0.499950 -0.403495 0.254396 -0.385154 -0.334633 0.267652 -0.618933 0.100402 -0.383893 -0.351532 0.229589 -0.224653 -0.228305 0.224201 0.223716 0.201326 0.214574 0.228409 0.192560 0.234990 0.189386 0.222049 0.226304 0.252375 0.267186 0.235589 0.238979
chargesum: 0.00000
title: Mulliken charges with hydrogens summed into heavy atoms:
elementType: F F F N C C C C C C C C C C C C C
charge: -0.165814 -0.162009 -0.164591 -0.080721 -0.052033 0.012406 0.254396 0.035815 -0.099642 0.267652 0.018806 0.100402 -0.131518 -0.084346 0.229589 0.010936 0.010674
polarizability: 1.91242163e+02 1.47694731e+01 1.38620144e+02 4.83624117e+00 4.79833824e+00 1.03761005e+02
1716.lowfreq: -8.8610 -2.3814 -0.0008 0.0006 0.0006 6.9522 32.6210 46.2944 54.1859
frequency: 32.5735 46.2125 54.1697 71.2148 120.4173 124.0282 184.8910 207.7311 224.9866 230.9291 251.1399 288.3979 316.2745 332.4542 351.7466 362.2685 375.9582 433.1279 471.7583 495.4518 530.1813 545.3208 566.2463 571.1931 609.8463 665.0466 716.5532 744.6453 756.5916 771.0761 791.6901 834.3154 886.8746 932.7611 949.7586 962.1884 963.6423 979.1948 989.9547 996.6264 997.9415 999.8278 1041.1171 1052.9601 1071.7195 1078.6380 1116.2580 1126.9071 1145.9694 1180.6582 1183.2625 1202.8053 1238.9266 1251.4005 1265.8893 1285.6486 1287.6655 1312.6489 1338.2139 1351.6941 1369.0370 1373.8708 1432.6214 1433.0998 1445.2369 1455.5885 1465.3737 1478.8049 1480.0507 1481.7095 1577.4787 1609.6551 1687.9150 2799.1111 2846.6716 2860.6808 2974.4639 2985.3081 3015.7383 3028.8482 3033.2210 3074.3435 3133.3547 3135.4863 3147.9961 3161.3372 3177.7118
redmass: 3.3157 4.5585 11.7878 4.2517 5.1171 4.3479 1.9423 4.0022 4.8069 1.8909 2.0909 3.9467 2.3911 3.5473 6.2461 2.7223 4.4748 6.9530 3.7131 4.8132 4.5940 4.9921 4.4027 4.0771 9.7358 5.9059 5.7642 5.1118 3.9936 1.2928 2.0913 1.2498 1.4012 2.7799 2.8194 2.1878 1.7426 4.8208 7.8968 2.0794 1.8313 3.0561 1.9243 2.2851 2.1003 1.5977 1.3347 1.8062 2.1929 1.0675 1.1842 1.4923 2.2498 2.1542 2.6345 1.7556 1.6008 1.3689 1.5498 1.8843 4.5613 1.6671 1.8735 1.3165 1.0933 1.0753 1.0585 1.2000 2.0843 1.0913 6.8912 6.2147 7.4339 1.0713 1.0649 1.0626 1.0607 1.0838 1.0726 1.0917 1.0965 1.1007 1.0862 1.0919 1.0909 1.0954 1.0987
irintensity: 1.1155 1.0789 0.1708 0.5631 0.1828 0.2584 3.8755 0.6179 0.6214 0.6112 0.9004 1.6151 5.3519 1.5026 6.8974 0.8357 0.8115 0.1882 4.2960 0.3638 7.7264 3.2451 0.1445 8.3383 10.0902 1.5056 0.3977 11.8140 2.4918 96.0080 4.7768 12.0234 2.8897 10.2429 4.4066 38.3649 31.0783 122.0781 102.8940 23.2684 61.5749 130.6869 18.1303 9.1965 3.9605 19.0306 4.5552 20.2463 15.2005 2.1057 9.0601 3.4221 26.6513 50.9358 92.3148 56.2415 28.0950 1.8432 2.3425 9.3488 16.7882 3.9832 12.2764 0.7234 8.6093 15.7934 15.7628 17.5994 17.0415 9.4427 11.1828 17.5512 7.4320 74.5426 54.1774 198.7436 25.4239 35.4346 52.1464 30.1342 37.8302 32.7584 2.5912 10.5036 9.8550 13.5855 13.5302
temp: 298.150 k
press: 1.00000 atm
elementType: 9 9 9 7 6 6 6 6 6 6 6 6 6 6 6 6 6 1 1 1 1 1 1 1 1 1 1 1 1 1 1
symmnumber: 1
zpe: 633627.9 jmol-1
zpe.correction: 0.241336 hartree
zpe.thermalcorrener: 0.256940 hartree
zpe.thermalcorrenthalpy: 0.257885 hartree
zpe.thermalcorrgfe: 0.197658 hartree
zpe.sumelectzpe: -856.780173 hartree
zpe.sumelectthermal: -856.764568 hartree
zpe.sumelectthermalent: -856.763624 hartree
zpe.sumelectthermalfe: -856.823850 hartree
dipole: -0.1439 2.7123 -0.0167
dipole: 2.7162
quadrupole: -85.4551 -100.5065 -99.1820
quadrupole: 9.1792 -0.9304 1.5808
quadrupole: 9.5928 -5.4587 -4.1341 9.1792 -0.9304 1.5808
hfenergy: -857.0215087 hartree
pointgroup: C01 [X(C13H14F3N1)]
dipole: -0.0068777 -1.0480262 -0.2086603 debye
polarizability: 192.6112536|-11.2517943|134.2512014|-6.3922223|10.7067566|106.7608572 unknown
InChI: InChI=1S/C13H14F3N/c1-17-8-6-10(7-9-17)11-4-2-3-5-12(11)13(14,15)16/h2-6H,7-9H2,1H3
charge 0 multiplicity 1
31 atoms
F  2.43384 2.635119 0.171407
F  0.385731 2.158616 -0.658017
F  0.774267 2.019408 1.574353
N  -3.539107 -0.471222 -0.014192
C  -1.437456 -0.631962 -1.319431
C  -2.835721 0.007593 -1.225747
C  -0.690224 -0.502064 0.00395
C  -2.855082 -0.042497 1.224528
C  -1.354464 -0.21536 1.15448
C  0.79146 -0.736584 -0.02449
C  -4.972055 -0.129427 0.000319
C  1.763737 0.297306 0.128712
C  1.265115 -2.058351 -0.236059
C  3.149595 0.002105 0.103685
C  1.345889 1.734014 0.29982
C  2.644045 -2.354728 -0.264323
C  3.592151 -1.321376 -0.088611
H  -0.857816 -0.137764 -2.123227
H  -1.534138 -1.70044 -1.598068
H  -2.728665 1.123193 -1.230323
H  -3.437544 -0.270733 -2.110618
H  -3.254811 -0.636332 2.071537
H  -3.071805 1.034213 1.470063
H  -0.806723 -0.096882 2.0971
H  -5.166917 0.97358 0.021721
H  -5.451805 -0.574555 0.891253
H  -5.464802 -0.547318 -0.895716
H  0.530419 -2.861745 -0.356583
H  3.874854 0.811822 0.223262
H  2.977603 -3.386984 -0.41672
H  4.664325 -1.541645 -0.105868
