program: Gaussian 09
title: 000016093
version: EM64L-G09RevD.01
frameworkgroup: C1[X(C13H18N2OS)]
method: RPBEPBE
basis: SDD
operation: Freq
keyword: #p
keyword: freq=noraman
keyword: PBEPBE/SDD
title: #p freq=noraman PBEPBE/SDD
converged: YES YES NO NO
title: Mulliken charges:
elementType: S O N N C C C C C C C C C C C C C H H H H H H H H H H H H H H H H H H
charge: 0.270132 -0.241850 -0.104300 -0.014163 -0.345081 -0.330886 -0.332648 -0.642742 -0.667573 -0.666702 -0.162154 0.260638 0.013844 -0.356649 -0.328028 -0.212910 -0.221178 0.214535 0.226833 0.209017 0.192721 0.208714 0.195348 0.294475 0.280102 0.210045 0.228868 0.209434 0.208656 0.228167 0.209369 0.250808 0.255513 0.230163 0.229478
chargesum: 0.00000
title: Mulliken charges with hydrogens summed into heavy atoms:
elementType: S O N N C C C C C C C C C C C C C
charge: 0.270132 -0.241850 -0.104300 -0.014163 0.096288 0.070852 0.071414 -0.068165 -0.019226 -0.020509 -0.162154 0.260638 0.013844 -0.105840 -0.072515 0.017253 0.008301
polarizability: 2.74510366e+02 1.37280621e+01 1.69805344e+02 4.30140736e+00 1.09275719e+01 1.12036521e+02
1716.lowfreq: -6.2464 -2.5245 -0.0013 -0.0010 0.0010 7.3931 9.9681 21.0189 36.4738
frequency: 7.4105 20.9652 36.2652 50.3300 77.7185 81.7883 93.3576 106.1484 156.3840 171.6725 206.0954 219.4086 241.9417 275.1933 293.1300 296.5317 312.5366 393.6748 405.1977 422.8381 443.8759 477.8895 481.1380 570.5790 581.1302 608.1877 631.3273 661.8687 746.1576 747.3811 758.1570 775.6294 776.6760 795.2378 800.3980 826.3393 859.0158 861.2742 911.7735 937.3770 977.7976 985.7142 999.0095 1004.6576 1010.8404 1052.5633 1075.4458 1079.6882 1084.8013 1095.2621 1097.0341 1140.5032 1151.8801 1163.7498 1207.3235 1224.3710 1226.8187 1246.8676 1277.6155 1282.3067 1294.3987 1305.1757 1363.0703 1366.4077 1377.9688 1387.8542 1390.3906 1395.7618 1433.0102 1444.4719 1454.7987 1461.3001 1464.8059 1468.7322 1470.6152 1479.3350 1486.2166 1486.5826 1492.2879 1605.3201 1618.2458 2862.9035 2869.9815 2893.7584 2983.2045 2985.6755 3025.0648 3039.6615 3044.9839 3055.8663 3075.7792 3078.2531 3093.0687 3093.9313 3138.7316 3140.6993 3156.5768 3175.1958 3181.9501
redmass: 3.6921 5.1255 4.1790 3.6155 2.4963 1.9810 2.4481 8.1866 1.6765 2.7292 1.9408 1.6360 6.2358 1.9547 6.6347 2.3795 2.9271 4.2053 5.6075 3.0271 2.8196 3.9175 3.9798 3.9508 8.9492 7.1807 9.3610 5.9525 3.1368 2.5162 1.4627 1.3649 3.7938 1.1377 1.2286 11.6702 1.3829 7.1503 1.8966 1.3782 1.3018 2.3906 2.9205 1.3915 3.4175 3.2357 2.0038 2.5685 2.2313 2.1047 1.6595 1.4907 1.5171 1.8582 2.2473 1.7725 2.8344 1.2539 1.4666 1.1169 1.2308 1.2487 1.3295 1.3298 1.3535 1.2335 1.2342 4.8464 3.0143 1.0886 2.8509 1.0560 1.0561 6.2739 1.0937 1.0552 1.0703 1.0732 1.0752 7.5327 8.0231 1.0719 1.0713 1.0706 1.0358 1.0358 1.0879 1.0876 1.0881 1.0589 1.0983 1.0982 1.1004 1.1004 1.0862 1.1095 1.0916 1.0955 1.0991
irintensity: 0.4275 0.1348 0.3674 0.5354 0.1557 0.4175 1.2325 1.3717 0.3089 1.5740 1.3363 1.7877 0.2533 3.3411 0.1928 1.3876 4.0005 1.8284 7.9624 7.0658 4.4207 2.1748 8.3295 0.0395 2.2842 0.8214 0.0769 55.6979 19.7814 31.0731 88.9190 17.6848 22.3684 4.4366 3.9367 17.1173 0.2103 3.0360 2.6335 4.2672 0.0178 29.0425 82.5969 3.3850 49.2419 15.6194 13.6827 38.5179 3.9017 12.5610 32.6016 9.6545 3.0641 0.8352 43.1401 19.6289 24.0980 30.2890 2.3204 0.2154 21.4387 14.0475 3.7319 2.7764 8.0527 20.3911 23.9983 21.3421 132.5431 12.9815 35.2447 3.2896 9.3637 273.1332 4.7690 4.7276 14.0924 11.2770 11.9896 5.2098 0.6095 35.4828 159.7498 100.6838 28.9221 30.1374 16.2243 13.6256 16.5846 9.3260 50.9011 69.3909 29.4692 53.0045 3.9575 10.4657 15.7418 11.3220 11.8112
temp: 298.150 k
press: 1.00000 atm
elementType: 16 8 7 7 6 6 6 6 6 6 6 6 6 6 6 6 6 1 1 1 1 1 1 1 1 1 1 1 1 1 1 1 1 1 1
symmnumber: 1
zpe: 751531.7 jmol-1
zpe.correction: 0.286243 hartree
zpe.thermalcorrener: 0.304118 hartree
zpe.thermalcorrenthalpy: 0.305062 hartree
zpe.thermalcorrgfe: 0.236414 hartree
zpe.sumelectzpe: -1087.647910 hartree
zpe.sumelectthermal: -1087.630035 hartree
zpe.sumelectthermalent: -1087.629091 hartree
zpe.sumelectthermalfe: -1087.697739 hartree
dipole: -2.5270 2.3966 0.2849
dipole: 3.4944
quadrupole: -89.7377 -111.6783 -111.7462
quadrupole: 8.0677 3.0222 -1.0303
quadrupole: 14.6497 -7.2909 -7.3588 8.0677 3.0222 -1.0303
hfenergy: -1087.9341529 hartree
pointgroup: C01[X(C13H18N2O1S1)]
dipole: 0.9866859 -0.898829 0.3296266 debye
polarizability: 274.0575702|8.0734669|158.9418888|-14.8975888|-24.8445673|123.3527723 unknown
InChI: InChI=1S/C13H18N2OS/c1-3-15(4-2)9-10-17-13-14-11-7-5-6-8-12(11)16-13/h5-8H,3-4,9-10H2,1-2H3
charge 0 multiplicity 1
35 atoms
S  0.425311 1.696006 -1.143094
O  -1.166985 -0.211639 0.09774
N  3.995411 -0.219226 -0.262003
N  -2.336956 1.577589 -0.836681
C  3.052088 0.826408 -0.722724
C  5.23697 0.321246 0.353729
C  4.242583 -1.272819 -1.284384
C  1.611401 0.380958 -0.415773
C  5.004851 0.89383 1.764916
C  4.622115 -2.632933 -0.668384
C  -1.149773 1.038082 -0.624541
C  -2.55328 -0.419961 0.334094
C  -3.261675 0.674227 -0.23929
C  -3.16574 -1.484731 1.001781
C  -4.667576 0.721771 -0.149159
C  -4.579605 -1.424618 1.085209
C  -5.312758 -0.343516 0.521021
H  3.16502 1.044172 -1.812215
H  3.260977 1.769141 -0.18595
H  5.962045 -0.509284 0.426062
H  5.710023 1.098039 -0.298358
H  3.312375 -1.39956 -1.869458
H  5.030357 -0.952086 -2.011521
H  1.437994 0.316655 0.66793
H  1.366421 -0.583995 -0.885326
H  4.285912 1.733338 1.75648
H  4.604377 0.110584 2.43152
H  5.953529 1.271792 2.189592
H  5.55639 -2.573873 -0.08133
H  3.820241 -2.982684 0.004614
H  4.774404 -3.387077 -1.462915
H  -2.594632 -2.311193 1.432724
H  -5.228129 1.55409 -0.583468
H  -5.117495 -2.230064 1.596247
H  -6.40439 -0.338069 0.609215
