program: Gaussian 09
title: 000179833
version: EM64L-G09RevD.01
frameworkgroup: C1[X(C12H10O6)]
method: RPBEPBE
basis: SDD
operation: Freq
keyword: #pfreq=noraman
keyword: PBEPBE/SDD
title: #p freq=noraman PBEPBE/SDD
converged: YES YES NO NO
title: Mulliken charges:
elementType: O O O O O O C C C C C C C C C C C C H H H H H H H H H H
charge: -0.336091 -0.417456 -0.424811 -0.206488 -0.427869 -0.244892 0.211427 0.161846 -0.323000 -0.319978 -0.228592 -0.206934 0.209253 -0.238543 -0.137711 0.116354 -0.299236 0.154772 0.253065 0.254170 0.230676 0.230537 0.259882 0.316019 0.379430 0.256778 0.396268 0.381125
chargesum: 0.00000
title: Mulliken charges with hydrogens summed into heavy atoms:
elementType: O O O O O O C C C C C C C C C C C C
charge: -0.336091 -0.038027 -0.028543 -0.206488 -0.046745 -0.244892 0.211427 0.161846 -0.069935 -0.065808 0.002084 0.023603 0.209253 0.021339 0.178308 0.116354 -0.042458 0.154772
polarizability: 3.27979550e+02 2.45578514e+01 1.11883538e+02 3.99326023e-01 1.66534440e+00 1.18935527e+02
1716.lowfreq: -5.2763 -0.0003 0.0005 0.0007 4.0620 8.9243 18.2849 25.3163 44.9402
frequency: 18.2644 25.2666 44.9325 52.1755 67.2044 83.0380 107.1249 162.8779 167.9235 194.8641 215.5453 265.2046 281.2358 308.3607 323.3308 383.1687 391.6884 434.9960 443.5943 466.1432 486.0031 499.3789 546.3879 551.0852 579.9476 591.9440 602.6717 622.4239 632.9029 690.5969 702.4525 726.0518 746.1610 753.7204 778.3583 831.4084 845.8720 873.5929 925.5301 929.4923 933.3801 968.7281 1020.9420 1024.9403 1029.5295 1046.6200 1076.2860 1129.5650 1157.5469 1166.5523 1175.8988 1194.2687 1225.9254 1250.5985 1260.1584 1292.8022 1311.6183 1321.0797 1372.4270 1403.7813 1452.4809 1479.5460 1587.4544 1608.7346 1612.7614 1618.8604 1629.4611 1644.4341 3116.7035 3137.0421 3146.5096 3153.5023 3165.0272 3167.1310 3178.5419 3518.5585 3525.6122 3531.9401
redmass: 6.3707 6.9554 7.6952 8.1998 10.0128 7.2807 5.9842 4.9521 8.1540 2.9720 6.2400 5.5929 5.4358 5.9006 3.4718 5.1041 5.2044 3.4202 2.1794 1.5830 4.5112 4.8847 4.2774 5.8518 3.2819 1.3463 1.6595 4.9220 4.2158 3.6401 4.5114 5.3516 3.2085 1.6143 5.6249 6.2062 1.3882 1.5935 1.3889 3.5572 1.9794 1.3033 2.4861 1.1468 2.9088 2.1194 2.4898 2.0639 2.4949 1.1005 1.4398 2.3902 1.4762 2.1821 1.5678 1.4829 1.6530 2.2509 2.3250 5.6081 2.4220 3.1028 7.6305 6.6330 7.1801 7.5548 8.8210 6.4072 1.0899 1.0861 1.0905 1.0954 1.0952 1.0881 1.0993 1.0643 1.0641 1.0647
irintensity: 0.2362 0.6044 0.3297 1.8957 1.3783 1.5238 0.9409 1.3535 3.0543 0.2554 0.9382 1.5914 4.3713 2.3543 5.2434 24.8801 15.5566 8.2447 61.9222 73.7043 50.7482 21.4103 6.8075 28.7463 2.7534 112.2455 114.7003 15.7660 8.8005 51.0836 3.1185 62.5366 49.0533 87.7114 10.8659 17.7651 0.9644 3.5392 3.3149 25.0661 16.8776 0.1516 69.1306 68.4435 187.0975 684.7361 30.3615 88.8299 177.6276 9.3502 203.1472 92.8013 37.4557 46.1546 8.1781 47.7778 121.7492 214.1319 8.6186 15.1955 9.6214 133.1578 75.2184 19.8611 29.0358 343.1057 391.4231 43.5867 6.2747 0.6734 12.1338 4.8078 13.7139 5.2676 14.0762 49.2483 70.3019 66.4208
temp: 298.150 k
press: 1.00000 atm
elementType: 8 8 8 8 8 8 6 6 6 6 6 6 6 6 6 6 6 6 1 1 1 1 1 1 1 1 1 1
symmnumber: 1
zpe: 520315.0 jmol-1
zpe.correction: 0.198178 hartree
zpe.thermalcorrener: 0.215242 hartree
zpe.thermalcorrenthalpy: 0.216186 hartree
zpe.thermalcorrgfe: 0.150616 hartree
zpe.sumelectzpe: -913.291645 hartree
zpe.sumelectthermal: -913.274581 hartree
zpe.sumelectthermalent: -913.273637 hartree
zpe.sumelectthermalfe: -913.339206 hartree
dipole: -1.3271 -0.8394 1.4998
dipole: 2.1714
quadrupole: -102.1719 -102.9702 -100.9712
quadrupole: 3.1161 9.7082 0.9693
quadrupole: -0.1341 -0.9325 1.0666 3.1161 9.7082 0.9693
hfenergy: -913.4898226 hartree
pointgroup: C01 [X(C12H10O6)]
dipole: 0.4507287 -0.3923445 0.6105396 debye
polarizability: 324.5422662|-3.7011606|118.0142269|36.1842801|-4.0583209|116.2421212 unknown
InChI: InChI=1S/C12H10O6/c13-8-4-1-2-5-9(8)18-10(12(16)17)6-3-7-11(14)15/h1-7,13-14,16H
charge 0 multiplicity 1
28 atoms
O  -0.908651 1.072237 -0.096907
O  -3.117476 2.228767 -1.256843
O  0.924775 -1.750112 -1.537305
O  -0.963699 -0.639002 -2.319983
O  6.038226 0.233735 1.489602
O  5.352792 -1.255787 -0.16833
C  -2.185724 0.461829 0.16171
C  -3.292474 1.128031 -0.420389
C  -2.34661 -0.654669 0.999117
C  -4.59359 0.657522 -0.14592
C  -3.653816 -1.127673 1.260304
C  -4.768875 -0.467205 0.690836
C  0.192273 0.232597 -0.365353
C  1.360615 0.513937 0.306945
C  2.661515 -0.092554 0.118455
C  -0.029756 -0.729286 -1.490896
C  3.75791 0.30271 0.846215
C  5.07194 -0.334369 0.639106
H  -1.471243 -1.135311 1.449639
H  -5.444045 1.172095 -0.602391
H  -3.797085 -1.996736 1.909918
H  -5.781532 -0.82969 0.896179
H  1.279256 1.315406 1.054271
H  2.77465 -0.899674 -0.612436
H  -2.146539 2.36784 -1.412447
H  3.706761 1.096344 1.599543
H  0.740149 -2.333529 -2.322611
H  6.913554 -0.211454 1.32837
