program: Gaussian 09
title: 000179821
version: EM64L-G09RevD.01
frameworkgroup: C1[X(C5H3Br3N2OS)]
method: RPBEPBE
basis: SDD
operation: Freq
keyword: #p
keyword: freq=noraman
keyword: PBEPBE/SDD
title: #p freq=noraman PBEPBE/SDD
converged: YES YES NO NO
title: Mulliken charges:
elementType: Br Br Br S O N N C C C C C H H H
charge: 0.114764 0.121907 0.077172 0.276991 -0.113723 -0.127127 0.062601 -0.023381 -0.146127 -0.196954 -0.091886 -0.821691 0.280803 0.275651 0.311000
chargesum: 0.00000
title: Mulliken charges with hydrogens summed into heavy atoms:
elementType: Br Br Br S O N N C C C C C
charge: 0.114764 0.121907 0.077172 0.276991 -0.113723 -0.127127 0.062601 -0.023381 -0.146127 -0.196954 -0.091886 0.045763
polarizability: 1.93413621e+02 -2.05570284e+00 1.45392981e+02 3.34046256e+00 4.31204716e+00 6.97363070e+01
1716.lowfreq: -4.3611 -3.8720 0.0009 0.0014 0.0015 3.0514 27.4389 35.6086 60.7981
frequency: 27.4167 35.5998 60.7932 83.5591 96.2587 101.9871 123.0884 136.6861 157.4774 223.4423 227.5519 241.1062 276.3732 348.5432 441.5254 465.6531 484.2498 567.3583 626.7280 637.5726 648.7137 653.6027 850.0701 912.6923 983.6865 1005.2566 1091.1002 1157.7487 1212.0069 1249.9140 1341.0693 1381.2402 1452.0491 1460.3604 1468.1350 1619.4913 3019.7696 3145.4092 3160.1064
redmass: 10.6533 14.1464 3.3459 1.1442 13.0582 56.3707 24.0053 8.3915 12.6856 6.8476 35.2349 9.1840 10.1279 13.1853 13.9813 14.0547 14.3722 12.0063 11.6835 12.5498 10.7481 9.5550 12.4905 12.7853 1.1787 1.2330 12.1889 12.7167 12.5878 13.0582 1.1329 12.6186 1.0517 1.0537 12.0095 11.7227 1.0284 1.1035 1.1065
irintensity: 0.8688 0.7656 0.9441 0.1209 1.7978 0.1813 0.3085 1.2719 0.9406 4.5990 0.3926 6.2546 1.2177 2.0401 0.0824 0.7286 14.7525 11.7931 6.6229 6.9211 24.1409 0.7246 224.6647 25.9563 3.4383 11.9708 101.8812 188.0899 154.7369 240.8900 17.1212 225.4199 21.6564 14.6653 56.5360 202.8386 16.8862 0.2095 4.9971
temp: 298.150 k
press: 1.00000 atm
elementType: 35 35 35 16 8 7 7 6 6 6 6 6 1 1 1
symmnumber: 1
zpe: 198432.9 jmol-1
zpe.correction: 0.075579 hartree
zpe.thermalcorrener: 0.089353 hartree
zpe.thermalcorrenthalpy: 0.090297 hartree
zpe.thermalcorrgfe: 0.030139 hartree
zpe.sumelectzpe: -814.570948 hartree
zpe.sumelectthermal: -814.557175 hartree
zpe.sumelectthermalent: -814.556231 hartree
zpe.sumelectthermalfe: -814.616388 hartree
dipole: -3.8107 2.8570 -0.9727
dipole: 4.8611
quadrupole: -86.0333 -103.9055 -108.0959
quadrupole: -2.7644 2.1276 -4.1125
quadrupole: 13.3116 -4.5606 -8.7510 -2.7644 2.1276 -4.1125
hfenergy: -814.6465274 hartree
pointgroup: C01 [X(C5H3Br3N2O1S1)]
dipole: -1.8352391 -0.5079267 0.1775794 debye
dipolederiv: 0.0432515 -0.104046 -0.0659651 -0.0155472 -0.3105179 -0.294271 -0.002564 -0.2676077 -0.0898962 -0.1328143 0.2659767 0.1388201 0.2056808 -0.3362165 -0.2235006 0.0774668 -0.1989158 -0.0455243 -0.5460429 0.1461671 0.071836 0.1861837 -0.0307325 -0.034676 0.0917863 -0.0327911 0.0218979 -0.4056854 -0.0850121 0.2382949 -0.1376269 -0.052333 0.0758052 0.4168328 0.1021969 -0.2943299 -0.6249685 -0.0435901 -0.132265 -0.1663909 -0.2285554 0.0655736 0.0627642 0.1588105 -1.0399402 -1.7816759 -0.2079942 -0.1137075 -0.2067782 -0.3536826 -0.2021662 -0.0883733 -0.1465082 -0.2078747 -1.1449393 0.2894531 0.1298334 0.3519026 -0.5459196 -0.2401911 0.0704795 -0.2384341 -0.2766526 0.2564645 0.2417489 0.1447391 -0.0807716 0.5739848 0.4979525 -0.1785075 0.403376 0.212932 0.9476311 -0.4836474 -0.2144651 0.0399588 0.8428087 0.4512604 0.3504028 0.4616692 0.181542 1.1585905 -0.3251353 -0.1093218 -0.6819292 0.0796772 0.0787422 -0.3605151 0.0963403 -0.0160078 2.0096536 0.3246274 -0.1491383 0.4586605 0.1822092 -0.1903365 -0.4323661 -0.3429446 1.4189711 0.2047439 -0.0115864 0.0162511 0.0297897 0.0634132 0.0201093 0.0953349 0.0279939 -0.1184757 -0.0575371 0.0484372 0.0086296 0.0676554 0.0032188 -0.0503326 -0.0203654 -0.0632026 0.1140613 -0.0172226 -0.0587605 0.0095798 -0.0638725 -0.0115842 0.0418006 -0.0134477 0.048207 0.1270895 0.0905509 0.0033616 0.0268789 0.013085 0.1242297 0.0042301 -0.0689279 -0.0081897 0.0122075 unknown
polarizability: 185.0382753|-12.6457599|121.8119165|-13.5457777|41.0702759|101.6927166 unknown
InChI: InChI=1S/C5H3Br3N2OS/c1-12-5(11)10-3(7)2(6)9-4(10)8/h1H3
charge 0 multiplicity 1
15 atoms
Br 0.784513 -2.257933 -1.652272
Br -0.391298 2.520753 1.540283
Br 3.993251 -0.756185 -0.291189
S  -2.444047 -0.470483 1.088304
O  -1.848439 -0.090338 -1.568163
N  -0.037286 0.069705 -0.052878
N  1.897605 0.963782 0.744028
C  1.037143 -0.715325 -0.564257
C  0.570458 1.075996 0.730773
C  2.196567 -0.150939 -0.038898
C  -1.440987 -0.116189 -0.393494
C  -4.151909 -0.530955 0.291667
H  -4.734906 0.330085 0.646479
H  -4.622524 -1.478852 0.587375
H  -4.013941 -0.488923 -0.800159
