program: Gaussian 09
title: 000179911
version: EM64L-G09RevD.01
frameworkgroup: C1[X(C14H6ClF6N3O5)]
method: RPBEPBE
basis: SDD
operation: Freq
keyword: #p
keyword: freq=noraman
keyword: PBEPBE/SDD
title: #p freq=noraman PBEPBE/SDD
converged: YES YES NO NO
title: Mulliken charges:
elementType: Cl F F F F F F O O O O O N N N C C C C C C C C C C C C C C H H H H H H
charge: 0.111979 -0.154591 -0.146894 -0.147484 -0.156931 -0.118802 -0.163404 -0.236987 -0.151063 -0.145200 -0.174003 -0.245010 -0.465191 -0.011862 0.021571 0.226188 0.518113 0.265761 0.458549 -0.554861 -0.601590 0.408531 0.268388 -0.378988 -0.327419 -0.343445 -0.304411 0.372043 0.398650 0.329891 0.357971 0.264939 0.273386 0.273800 0.278376
chargesum: 0.00000
title: Mulliken charges with hydrogens summed into heavy atoms:
elementType: Cl F F F F F F O O O O O N N N C C C C C C C C C C C C C C
charge: 0.111979 -0.154591 -0.146894 -0.147484 -0.156931 -0.118802 -0.163404 -0.236987 -0.151063 -0.145200 -0.174003 -0.245010 -0.107220 -0.011862 0.021571 0.226188 0.518113 0.265761 0.458549 -0.554861 -0.271699 0.408531 0.268388 -0.114050 -0.054033 -0.069645 -0.026035 0.372043 0.398650
polarizability: 3.52510436e+02 -1.28914702e+01 2.38975125e+02 2.68108248e+01 6.09298543e+00 1.31890551e+02
1716.lowfreq: -2.4099 -0.0013 -0.0011 0.0003 1.8592 3.8101 13.0160 18.6972 24.2519
frequency: 13.0090 18.6900 24.2277 41.2981 46.0958 59.2549 60.7036 69.4868 85.6377 90.3411 109.3232 131.0238 139.8684 154.4344 161.6400 177.4116 202.0876 211.2661 250.3231 263.4302 283.6021 288.8222 307.0679 316.4034 327.3211 359.5803 374.8296 381.5226 391.4990 409.0728 417.1053 436.3133 450.2265 476.4623 500.3100 510.1167 530.7598 532.9822 558.4300 576.3429 596.1139 605.0352 630.7150 636.5770 649.0458 678.1170 687.3003 699.0263 707.5088 714.0656 727.4869 738.7731 805.1079 807.5275 816.9888 827.8196 848.1363 862.8320 897.2943 928.2257 945.4187 954.1921 965.3433 989.1555 1005.0418 1005.4253 1029.0444 1065.9143 1073.8213 1122.0735 1138.0021 1147.0656 1158.1298 1174.6939 1193.0518 1205.2304 1218.9593 1261.7818 1292.9587 1316.3767 1336.9175 1363.3961 1381.2412 1388.3987 1413.2261 1424.1384 1486.5946 1492.3997 1499.2119 1578.0957 1599.6647 1613.1696 1622.3744 3158.3684 3160.5756 3169.4229 3185.8324 3185.9689 3190.3212
redmass: 15.4166 14.2639 12.2767 7.7576 17.3056 13.9501 10.1875 9.4679 13.3918 13.4428 12.7351 13.7974 10.6114 9.5952 11.5849 13.4455 11.8440 18.3640 10.3083 10.5177 12.3219 13.6678 13.3519 8.7501 13.1473 10.6203 9.0001 13.4103 8.5431 3.0036 6.2833 8.9722 12.1794 10.0401 8.5657 3.8711 13.9472 9.7824 7.4280 11.3258 9.4393 11.4101 9.9181 8.3219 7.7113 8.8155 9.9349 6.8954 7.1587 7.5751 9.0868 9.9160 6.3473 1.6246 1.6692 1.5977 3.0454 6.4514 4.1816 7.5026 1.4279 1.4846 1.3754 9.8708 6.6274 3.0752 12.4917 11.1471 12.0980 1.3744 3.2561 7.3984 4.2827 2.7411 1.5831 3.6832 5.0401 4.0606 2.2495 1.5430 11.9431 3.8042 8.2065 12.6599 10.4090 3.5024 4.1866 3.2476 4.0843 2.6423 5.0996 6.7455 6.4629 1.0908 1.0904 1.0784 1.0964 1.0917 1.0963
irintensity: 0.1463 0.0077 0.0552 1.0256 0.0193 0.6860 0.1873 1.1934 0.3962 0.3666 2.9963 1.4437 0.1440 2.0837 2.1616 4.3095 1.0774 0.4954 1.3963 2.1717 4.6419 0.9918 2.9776 1.0307 13.6097 0.2458 0.8446 0.2800 2.2957 0.7347 9.5357 1.2343 1.9281 1.5295 1.1679 27.9770 0.7256 2.6154 8.5251 18.3307 3.9652 45.4143 1.0144 2.1420 6.3990 1.9329 18.5972 3.0392 10.2239 1.8350 9.1763 4.2111 29.0778 11.6642 18.4456 35.1559 89.1103 18.5215 22.6066 27.3082 7.4356 84.2547 4.5395 306.2363 154.0874 42.6398 97.0980 273.1491 188.8680 17.5643 120.7227 1010.8149 291.2578 625.4968 88.5537 66.7461 95.4333 163.9787 55.4888 16.2179 312.1118 17.9342 15.4202 98.0183 21.9425 7.3677 33.4850 115.9779 190.5828 199.4213 25.7949 195.0343 164.8675 3.0405 4.2428 147.5682 1.8016 27.6056 0.8800
temp: 298.150 k
press: 1.00000 atm
elementType: 17 9 9 9 9 9 9 8 8 8 8 8 7 7 7 6 6 6 6 6 6 6 6 6 6 6 6 6 6 1 1 1 1 1 1
symmnumber: 1
zpe: 515070.2 jmol-1
zpe.correction: 0.196180 hartree
zpe.thermalcorrener: 0.221933 hartree
zpe.thermalcorrenthalpy: 0.222878 hartree
zpe.thermalcorrgfe: 0.136356 hartree
zpe.sumelectzpe: -2134.305903 hartree
zpe.sumelectthermal: -2134.280149 hartree
zpe.sumelectthermalent: -2134.279205 hartree
zpe.sumelectthermalfe: -2134.365727 hartree
dipole: 0.7036 1.7660 0.4307
dipole: 1.9492
quadrupole: -199.6639 -185.4666 -169.6925
quadrupole: 9.7346 0.2797 6.6535
quadrupole: -14.7229 -0.5256 15.2485 9.7346 0.2797 6.6535
hfenergy: -2134.5020825 hartree
pointgroup: C01 [X(C14H6Cl1F6N3O5)]
dipole: -0.3322375 -0.5763653 0.3814479 debye
polarizability: 348.3238381|-31.4105531|228.7331925|-22.5242558|-35.8227|146.3190808 unknown
InChI: InChI=1S/C14H6ClF6N3O5/c15-10-8(13(16,17)18)5-9(23(25)26)11(12(10)24(27)28)22-6-1-3-7(4-2-6)29-14(19,20)21/h1-5,22H
charge 0 multiplicity 1
35 atoms
Cl 2.939059 2.758317 -0.445104
F  5.967468 -0.598537 -0.933121
F  5.062105 1.126734 -2.085926
F  5.731749 1.420259 0.061647
F  -5.323848 2.393129 -1.166599
F  -7.297766 1.405413 -0.624594
F  -5.870842 0.383843 -2.068766
O  -5.432362 0.516705 0.227635
O  -0.057598 1.608544 1.794006
O  -0.065447 2.328025 -0.374963
O  3.174582 -3.906032 0.506164
O  1.056403 -3.604349 1.281521
N  -0.120271 -1.320322 0.880983
N  0.353639 1.570589 0.574307
N  2.166895 -3.144941 0.748329
C  1.112733 -0.831599 0.5326
C  1.394326 0.55665 0.255416
C  2.254981 -1.718749 0.427744
C  3.730378 0.082589 -0.336071
C  2.655062 1.003886 -0.175376
C  3.511074 -1.260035 -0.007254
C  -1.423547 -0.76081 0.684444
C  5.096451 0.507015 -0.814451
C  -2.381718 -0.918513 1.71748
C  -1.802066 -0.173164 -0.547506
C  -3.702786 -0.480505 1.524345
C  -3.121947 0.279512 -0.747293
C  -4.052447 0.116775 0.297704
C  -5.954301 1.154868 -0.87532
H  4.320098 -1.989679 -0.093135
H  -0.062956 -2.302037 1.228492
H  -2.086301 -1.364831 2.671789
H  -1.082612 -0.086812 -1.367381
H  -4.458277 -0.584425 2.30728
H  -3.395915 0.733189 -1.702131
