program: Gaussian 09
title: 000179820
version: EM64L-G09RevD.01
frameworkgroup: C1[X(C11H8Br3N3O)]
method: RPBEPBE
basis: SDD
operation: Freq
keyword: #p
keyword: freq=noraman
keyword: PBEPBE/SDD
title: #p freq=noraman PBEPBE/SDD
converged: YES YES NO NO
title: Mulliken charges:
elementType: Br Br Br O N N N C C C C C C C C C C C H H H H H H H H
charge: 0.100024 0.104361 0.066778 -0.170538 -0.206654 -0.188198 0.061298 0.457373 0.201471 -0.645420 -0.300798 -0.346922 -0.054447 -0.181490 -0.225662 -0.227232 -0.219482 -0.239770 0.272103 0.259518 0.254709 0.281165 0.245061 0.234520 0.232296 0.235936
chargesum: 0.00000
title: Mulliken charges with hydrogens summed into heavy atoms:
elementType: Br Br Br O N N N C C C C C C C C C C C
charge: 0.100024 0.104361 0.066778 -0.170538 -0.206654 -0.188198 0.061298 0.457373 0.201471 0.140910 -0.019633 -0.101861 -0.054447 -0.181490 0.008858 0.005064 -0.219482 -0.003833
polarizability: 2.70794727e+02 -4.36040471e+00 1.82479065e+02 1.35393022e+00 1.72576630e+01 1.14068099e+02
1716.lowfreq: -1.6769 -0.0004 -0.0003 0.0003 4.9454 7.9845 15.0794 22.1798 26.5565
frequency: 14.8389 22.1482 26.5366 51.6527 82.2046 96.6527 105.1366 111.4890 126.7325 158.3085 176.7219 196.2987 228.2970 230.1790 268.8215 294.7258 356.4499 365.3312 402.8511 414.8398 455.0219 468.9275 491.5878 534.3551 578.1200 613.9608 634.0670 655.9785 674.7957 692.4076 716.6391 766.4871 788.0549 832.5528 909.6306 913.1676 969.2902 987.3729 994.6621 1004.9501 1030.0511 1085.5482 1099.7752 1108.7749 1120.0847 1167.7132 1177.0837 1197.1924 1220.1751 1242.1987 1266.5127 1316.3268 1334.4367 1372.0929 1384.3821 1443.7847 1445.5551 1458.0582 1478.7678 1485.0642 1491.2091 1593.2701 1609.2504 1648.8985 3000.2583 3097.6812 3134.0382 3136.6549 3144.5494 3157.9414 3170.7380 3199.9773
redmass: 8.4808 4.9531 11.4681 4.6929 9.5789 36.0748 12.3326 11.4246 5.7983 6.9333 1.6671 2.3591 7.9464 72.3178 9.8941 5.8782 3.6867 10.2717 2.9622 4.0647 12.3746 9.0076 7.6080 4.0459 6.4213 6.3341 12.1458 8.3969 7.9674 1.9454 9.2511 1.9971 4.4471 1.2575 3.9814 1.8698 1.3780 5.5055 1.3455 4.7791 2.1907 2.1610 1.8119 2.4390 1.5365 12.4048 1.0508 1.1486 4.9355 11.2078 11.0420 2.4143 1.7372 11.8009 9.2652 1.5506 1.5442 11.8653 1.0503 2.2120 1.0755 6.3521 6.0472 11.2525 1.0394 1.0970 1.0862 1.0997 1.0897 1.0942 1.1000 1.0952
irintensity: 0.3398 0.3020 0.0910 2.6477 0.3610 0.5926 0.1123 0.8304 1.1136 4.0840 1.1090 1.9912 0.4103 0.1679 0.7967 4.0776 0.2167 1.3625 0.8112 1.3615 0.2926 15.6748 11.5275 5.5191 3.4721 0.4712 0.8646 11.0486 10.0298 48.1214 3.5655 62.1376 7.7644 0.7725 45.5136 29.0691 0.3578 2.6067 0.4153 28.0655 27.9553 25.5463 18.8742 210.1434 2.1071 158.5897 0.2987 0.0551 7.2477 100.4855 208.2991 148.9219 58.9882 174.4993 0.9408 4.8495 17.5095 51.6060 22.2698 65.3005 29.9153 3.8613 33.9044 332.8099 23.8932 9.9571 3.5219 9.9520 7.5224 26.3773 17.2390 1.0033
temp: 298.150 k
press: 1.00000 atm
elementType: 35 35 35 8 7 7 7 6 6 6 6 6 6 6 6 6 6 6 1 1 1 1 1 1 1 1
symmnumber: 1
zpe: 449977.1 jmol-1
zpe.correction: 0.171387 hartree
zpe.thermalcorrener: 0.189075 hartree
zpe.thermalcorrenthalpy: 0.190020 hartree
zpe.thermalcorrgfe: 0.120340 hartree
zpe.sumelectzpe: -702.508205 hartree
zpe.sumelectthermal: -702.490517 hartree
zpe.sumelectthermalent: -702.489573 hartree
zpe.sumelectthermalfe: -702.559252 hartree
dipole: -4.9572 -1.4273 3.5893
dipole: 6.2844
quadrupole: -120.2693 -130.1571 -132.1530
quadrupole: -4.8425 -5.6141 3.4232
quadrupole: 7.2572 -2.6306 -4.6266 -4.8425 -5.6141 3.4232
hfenergy: -702.6795925 hartree
pointgroup: C01 [X(C11H8Br3N3O1)]
dipole: 2.0749486 -0.261452 -1.3188603 debye
dipolederiv: -0.0111973 0.1731334 -0.0093295 0.0853363 -0.4778724 0.0205925 -0.0117663 0.0153559 0.0870926 -0.1334812 -0.2684289 -0.0323866 -0.1896456 -0.4642395 -0.0589794 -0.0255348 -0.0374149 0.03875 -0.5178889 -0.2024493 -0.0718648 -0.2452531 -0.0929804 -0.0350993 -0.0933231 -0.037986 0.0179002 -0.6854229 0.0175661 -0.0767749 0.0153322 -0.2795063 0.1228042 0.3330369 0.0784854 -1.0146708 -1.3324517 -0.0091833 0.248294 0.00817 -0.2020422 0.0293401 0.3807349 0.1032692 -0.7088826 -1.5462789 0.0960527 -0.2091504 -0.0035539 -0.4023672 0.0090691 -0.2345441 0.0029668 -0.1407559 -1.0628975 -0.3211429 -0.1259051 -0.2775967 -0.7679344 -0.0536152 -0.1579415 -0.0589365 -0.1625156 1.038106 0.0108424 0.0358179 -0.080126 0.088119 0.0011031 0.2101907 -0.0449462 -0.0280116 2.2209967 -0.0656571 -0.1635078 0.0255061 0.2394038 -0.1969701 -0.6906813 -0.1198262 1.5074715 0.0075764 -0.0165298 0.0625629 -0.0909879 0.1967913 -0.0667856 0.0685262 -0.0436589 0.3721855 -0.1877563 0.0403416 -0.0562669 0.0436409 -0.0900721 -0.0214171 -0.1495247 -0.0400877 -0.0792762 -0.1984725 -0.0181734 0.0289564 -0.0199643 -0.0910825 -0.0964676 0.0591269 -0.0557976 -0.0567719 0.2555242 -0.3383191 0.021788 0.09556 0.7989296 -0.0373334 0.0145759 -0.0330947 -0.1078547 0.8394832 0.5366379 0.1245827 -0.1631397 1.006952 0.0945236 0.1708156 0.1098604 -0.0169413 0.0238618 -0.0365927 0.0620418 -0.062005 -0.0322186 -0.1192303 0.0657231 -0.1448842 0.0326685 0.0076774 0.0523457 -0.0366871 0.1123355 -0.0378927 -0.1189523 -0.0816236 -0.1178797 -0.016769 1.0595667 0.3730869 0.1907625 0.7772786 0.2651126 0.1058619 0.1859922 0.0610829 -0.0473271 0.0347217 0.0019598 0.0302277 -0.0256947 -0.1315921 -0.0279088 0.0454152 -0.0331767 -0.1112805 -0.0433391 -0.0572366 -0.0913769 -0.06562 0.0603215 0.0053833 -0.074373 0.0216589 0.0943946 0.0085408 0.0616135 0.1251942 0.0825934 0.0607654 -0.0255812 0.0743005 -0.0156742 0.0169888 0.1245661 -0.0035386 -0.0154471 0.0036218 -0.0820765 0.0929453 -0.0307886 0.0030039 0.0086337 0.1024293 -0.0557902 0.0482191 -0.0617854 0.1024904 0.0363969 0.042823 0.0539052 0.0978826 0.0814031 0.055469 -0.0700297 0.0578126 0.0676748 0.1032964 -0.0752029 0.0867642 0.036279 0.0397754 0.0332588 -0.0495147 0.057198 0.0630501 0.1087194 -0.0680821 0.1118986 0.0174265 -0.001001 -0.0602811 0.0604228 -0.080267 0.0666428 0.0955433 0.0735206 0.0992014 0.0456678 -0.1240412 0.0010151 -0.0306285 0.0012536 0.1356236 0.032761 -0.0313956 0.0359105 0.1177162 unknown
polarizability: 266.2096566|19.7552416|185.4982387|10.143172|-17.924356|115.6339961 unknown
InChI: InChI=1S/C11H8Br3N3O/c1-16(7-5-3-2-4-6-7)11(18)17-9(13)8(12)15-10(17)14/h2-6H,1H3
charge 0 multiplicity 1
26 atoms
Br -2.110035 -2.810966 0.110002
Br -1.435935 2.971934 0.217667
Br -5.481583 -1.11254 -0.503594
O  0.065541 -0.337866 1.805417
N  0.722232 -0.000952 -0.444389
N  -1.590591 0.064645 0.165639
N  -3.597523 1.076894 -0.184022
C  2.152606 -0.032568 -0.196624
C  -0.183363 -0.115997 0.597924
C  0.276713 0.222879 -1.846356
C  2.712006 -0.843904 0.824349
C  3.005756 0.744059 -1.023212
C  -2.558595 -0.958849 0.022224
C  -2.294652 1.267135 0.040831
C  4.110707 -0.86879 1.006963
C  4.402973 0.708032 -0.830653
C  -3.771431 -0.30589 -0.201856
C  4.963925 -0.098037 0.184992
H  -0.702718 -0.245474 -2.015926
H  1.006507 -0.244901 -2.524788
H  0.198619 1.299608 -2.082495
H  2.064881 -1.436492 1.472469
H  2.588744 1.39047 -1.801556
H  4.532554 -1.499209 1.797001
H  5.049511 1.316894 -1.471698
H  6.048346 -0.124017 0.334488
