program: Gaussian 09
title: 000179813
version: EM64L-G09RevD.01
frameworkgroup: C1[X(C10H17NO6S)]
method: RPBEPBE
basis: SDD
operation: Freq
keyword: #p
keyword: freq=noraman
keyword: PBEPBE/SDD
title: #p freq=noraman PBEPBE/SDD
converged: YES YES NO NO
title: Mulliken charges:
elementType: S O O O O O O N C C C C C C C C C C H H H H H H H H H H H H H H H H H
charge: 0.132993 -0.252654 -0.388973 -0.247862 -0.285724 -0.276358 -0.448429 -0.365019 -0.099805 -0.685879 -0.684309 -0.439034 0.177761 0.313059 0.279363 -0.316304 -0.769591 -0.311049 0.304708 0.283634 0.278609 0.281549 0.305770 0.253672 0.261976 0.318224 0.245420 0.221201 0.216267 0.255820 0.256537 0.223649 0.203163 0.387001 0.370613
chargesum: 0.00000
title: Mulliken charges with hydrogens summed into heavy atoms:
elementType: S O O O O O O N C C C C C C C C C C
charge: 0.132993 -0.252654 -0.001972 -0.247862 -0.285724 -0.276358 -0.077817 -0.046795 0.204903 -0.123636 -0.096989 0.076614 0.177761 0.313059 0.279363 0.150317 -0.040967 0.115763
polarizability: 2.14446875e+02 1.12858770e+01 1.22779114e+02 -9.05814789e-02 3.20874297e-01 1.30392753e+02
1716.lowfreq: -22.4422 -8.3620 -5.2788 0.0013 0.0019 0.0022 2.5879 14.6272 16.6525
frequency: -12.5904 14.3679 16.3890 35.0234 42.1111 43.8266 66.3421 72.3982 84.3479 96.2446 103.6282 118.9840 138.4352 166.9623 190.7642 220.6903 234.4547 262.8144 292.4926 336.8099 348.2475 354.8207 397.4227 435.5899 462.4298 513.1067 514.5235 578.2253 591.8319 597.7700 618.0314 622.0406 629.8210 652.6501 655.8155 702.0688 703.0476 757.4998 771.9573 796.7600 876.8269 885.0013 909.3862 950.7406 975.9813 993.1242 1003.1240 1010.0563 1042.6560 1048.6267 1060.0052 1063.5370 1075.2287 1130.3443 1139.2440 1174.3954 1190.1033 1207.7701 1223.3206 1243.0653 1247.7651 1250.4659 1285.7448 1294.5034 1301.5156 1330.8987 1336.6084 1344.2071 1356.9797 1389.6884 1412.0775 1421.1383 1437.8683 1441.5502 1449.2633 1451.5618 1455.2740 1461.5387 1474.9546 1614.2610 1616.2987 1641.7061 2935.5427 2948.1157 2999.4402 3001.4592 3023.6281 3047.9664 3052.2737 3053.2665 3072.8869 3096.4128 3109.4840 3112.6839 3126.7866 3129.9821 3399.0582 3509.6279 3542.1216
redmass: 5.0086 6.2397 6.7162 6.2145 5.3289 4.4273 2.9005 1.6993 3.2884 3.6809 4.3317 6.1067 2.6101 4.3019 3.9713 5.0991 4.8650 5.0357 3.9754 3.6278 2.7847 4.4502 3.4952 3.5593 2.6507 3.5578 3.5596 2.9667 3.4580 2.2182 1.8799 2.4031 2.1421 1.6409 1.8856 3.9611 4.0457 1.3996 3.7985 2.7303 3.6755 3.2472 2.4158 4.1023 1.9779 2.5234 1.7074 2.2446 1.6598 3.0395 3.4025 3.1372 1.9594 1.8295 2.3415 1.5723 1.0719 1.3221 1.4606 1.3146 1.1875 1.4131 1.2171 1.3936 1.5234 1.5903 1.7783 1.2546 1.4053 1.2325 1.1978 1.0877 1.1043 1.0769 1.1019 1.0901 1.0759 1.3141 1.4761 6.5045 8.1528 9.0371 1.0790 1.0689 1.0362 1.0641 1.0608 1.0584 1.0581 1.0935 1.0962 1.0988 1.1000 1.1051 1.1073 1.1075 1.0658 1.0640 1.0782
irintensity: 3.2948 0.5231 2.4417 0.7085 1.5200 1.0360 5.8956 1.4085 7.3337 0.5927 0.7603 4.1176 5.2945 12.2508 3.8857 4.1972 12.2276 9.2892 1.1657 3.6097 3.9540 4.7411 1.7396 9.2460 11.1904 16.7580 22.7636 1.7691 65.1977 62.9944 38.8941 83.4941 31.7932 150.1236 57.4857 10.8788 9.7141 15.7634 23.6341 13.8300 31.2555 8.3585 11.8411 12.9792 18.7050 43.5996 4.1554 47.5417 6.2234 61.5410 10.6494 3.5003 188.5758 110.2188 31.1258 149.7156 20.1938 18.3181 1.8252 27.9547 24.9705 52.2176 12.2314 36.9637 81.7224 65.2988 20.9807 26.3001 36.9870 71.9277 105.1434 15.4902 9.1787 20.8966 51.9343 24.5071 6.8156 175.0907 109.7286 181.4927 142.1516 263.6118 55.9011 55.3419 8.5003 8.0527 21.6218 3.2793 11.1005 47.6770 5.6121 12.6049 13.1031 19.3836 1.0104 4.2249 193.3301 35.2319 35.8834
temp: 298.150 k
press: 1.00000 atm
elementType: 16 8 8 8 8 8 8 7 6 6 6 6 6 6 6 6 6 6 1 1 1 1 1 1 1 1 1 1 1 1 1 1 1 1 1
symmnumber: 1
zpe: 715485.8 jmol-1
zpe.correction: 0.272514 hartree
zpe.thermalcorrener: 0.292904 hartree
zpe.thermalcorrenthalpy: 0.293848 hartree
zpe.thermalcorrgfe: 0.218769 hartree
zpe.sumelectzpe: -1294.011108 hartree
zpe.sumelectthermal: -1293.990718 hartree
zpe.sumelectthermalent: -1293.989774 hartree
zpe.sumelectthermalfe: -1294.064853 hartree
dipole: -0.7157 -1.8712 -0.0953
dipole: 2.0057
quadrupole: -130.3784 -112.2076 -116.2111
quadrupole: -8.1081 31.1270 -1.4405
quadrupole: -10.7794 7.3915 3.3879 -8.1081 31.1270 -1.4405
hfenergy: -1294.2836222 hartree
pointgroup: C01 [X(C10H17N1O6S1)]
dipole: -0.2104297 0.2014052 0.7333787 debye
polarizability: 206.8614442|-22.7935318|136.4240585|-14.3662349|1.6739967|124.3332391 unknown
InChI: InChI=1S/C10H17NO6S/c1-7(13)11-8(10(15)16)6-18-5-2-9(14)17-4-3-12/h8,11-12,15H,2-6H2,1H3
charge 0 multiplicity 1
35 atoms
S  -0.621926 0.138094 1.801741
O  4.429429 0.305663 0.462964
O  -2.93093 -0.335543 -1.868276
O  -0.682075 0.224392 -1.854206
O  3.490522 -1.829175 0.520592
O  -4.628935 2.781471 -0.269068
O  5.598515 -2.418621 -1.155136
N  -3.402625 0.957537 0.477902
C  -2.207677 1.349748 -0.261679
C  -0.999324 1.614115 0.661045
C  0.881094 -0.631273 0.939415
C  2.181078 0.119699 1.277984
C  -1.833047 0.366639 -1.38044
C  3.404675 -0.588316 0.717975
C  -4.568662 1.70987 0.408859
C  5.780866 -0.226965 0.056393
C  -5.754137 1.162535 1.190822
C  5.798558 -0.984218 -1.284888
H  -2.489695 2.303182 -0.765798
H  -1.218462 2.465144 1.323927
H  -0.09615 1.827402 0.068317
H  0.92083 -1.669644 1.305233
H  0.686136 -0.641721 -0.143814
H  2.166522 1.158131 0.904852
H  2.301671 0.183396 2.37745
H  -3.362326 0.092836 1.021749
H  6.157268 -0.881717 0.864069
H  6.375304 0.699158 0.009373
H  -5.493964 0.310518 1.841717
H  -6.185051 1.969977 1.805707
H  -6.534688 0.839948 0.479369
H  6.80454 -0.871057 -1.727465
H  5.067666 -0.512908 -1.978745
H  -2.640506 -0.910241 -2.628479
H  4.779908 -2.553455 -0.596859
