program: Gaussian 09
title: 000179834
version: EM64L-G09RevD.01
frameworkgroup: C1[X(C12H20FN3O6S)]
method: RPBEPBE
basis: SDD
operation: Freq
keyword: #p
keyword: freq=noraman
keyword: PBEPBE/SDD
title: #p freq=noraman PBEPBE/SDD
converged: YES YES NO NO
title: Mulliken charges:
elementType: S F O O O O O O N N N C C C C C C C C C C C C H H H H H H H H H H H H H H H H H H H H
charge: 0.171232 -0.240746 -0.236445 -0.252625 -0.404204 -0.258440 -0.413004 -0.216361 -0.190416 -0.607257 -0.571812 -0.366532 -0.519716 -0.165341 -0.224215 0.258948 0.259030 -0.769091 -0.501287 0.157723 0.206884 -0.669902 -0.163046 0.239904 0.243377 0.295952 0.270659 0.294873 0.262753 0.253998 0.278374 0.306023 0.339373 0.295729 0.292590 0.293858 0.275637 0.304829 0.253204 0.245846 0.212620 0.376821 0.380202
chargesum: 0.00000
title: Mulliken charges with hydrogens summed into heavy atoms:
elementType: S F O O O O O O N N N C C C C C C C C C C C C
charge: 0.171232 -0.240746 -0.236445 -0.252625 -0.027383 -0.258440 -0.032802 -0.216361 -0.190416 -0.018938 -0.002318 0.116749 0.046895 0.129533 0.038538 0.258948 0.259030 -0.236718 0.144110 0.157723 0.206884 -0.111869 0.295419
polarizability: 2.02475090e+02 -3.18528588e+00 1.95978359e+02 -6.19556073e+00 -8.81743178e-01 1.61801858e+02
1716.lowfreq: -6.4443 -3.6560 -3.3199 -0.0018 -0.0018 -0.0013 17.7427 23.2747 29.6435
frequency: 17.5969 23.1972 29.5010 35.3457 49.1005 57.4587 60.3304 62.3493 73.3712 81.2253 88.3968 101.0657 118.0687 129.6841 164.6683 167.0689 174.6477 196.6199 212.3909 229.7529 245.8776 254.2126 270.2742 295.6060 316.3226 330.9354 347.8471 359.5884 375.3830 383.3131 403.8306 416.0124 424.9203 446.5356 494.9009 499.3981 548.7178 556.7317 582.7659 608.4369 614.3831 626.0739 637.3461 660.7351 665.1777 667.0529 717.4275 728.3755 731.6160 741.8515 780.9798 790.3914 818.6689 858.4956 869.7708 893.0173 918.9514 927.0579 979.2680 1000.1443 1017.4421 1029.0153 1043.8548 1054.9007 1058.3048 1066.2480 1075.1212 1087.2639 1119.2071 1148.3501 1154.5760 1160.0292 1171.0334 1185.9652 1204.5451 1212.8477 1233.6086 1235.6898 1263.7559 1265.6727 1275.8104 1295.6289 1299.0666 1315.2239 1322.9951 1332.7610 1364.2084 1366.2671 1371.4708 1378.6299 1383.7525 1415.5294 1421.3322 1429.9064 1454.9124 1457.6576 1463.6259 1597.0460 1615.2162 1640.8926 1642.7501 1651.9430 1681.4056 2951.7654 3008.6933 3010.1045 3019.8004 3025.2168 3025.5607 3030.3059 3043.7267 3059.1819 3082.0809 3084.5648 3093.8779 3098.0645 3108.8393 3444.0820 3458.3267 3500.4747 3522.4309 3571.0131 3578.3575
redmass: 8.7894 8.9735 7.5547 6.7709 5.7433 7.6684 7.1281 7.3111 6.5546 9.1162 5.5608 5.6859 5.2265 9.0981 2.6434 4.8441 4.4909 3.8592 1.2856 3.5581 3.3619 3.6570 2.7394 4.2147 3.1634 2.8827 2.2369 2.0496 4.0352 3.2335 3.5487 5.2801 3.7507 3.0877 2.3275 1.9312 3.8050 2.9676 1.7489 3.5329 2.4988 1.5007 3.3047 3.0745 2.0094 1.8626 3.4351 4.4339 4.4293 2.2206 2.7300 3.1983 1.9508 4.5906 3.6772 2.0674 3.1234 2.4865 2.8664 1.8191 2.9433 3.0081 2.5254 2.4944 2.1398 2.4210 3.3454 2.5933 1.2988 2.4112 1.6386 1.6614 1.3153 1.2436 1.4279 1.2315 2.1141 1.5707 1.2059 1.6823 1.6631 1.2407 1.2003 1.4917 1.4564 1.2270 1.6512 1.4796 1.2758 1.6131 1.5614 1.0949 1.0964 1.1087 1.0776 1.0882 1.0866 6.6247 7.6741 1.1878 6.7890 1.0984 8.3004 1.0718 1.0583 1.0587 1.0591 1.0621 1.0607 1.0842 1.0827 1.0977 1.0898 1.1102 1.1032 1.1053 1.1041 1.0448 1.0453 1.0641 1.0642 1.0980 1.0969
irintensity: 2.1353 0.7032 0.5506 0.5299 0.8190 2.0864 2.4853 0.1975 0.5579 1.7543 3.1207 1.5059 5.3534 3.2496 6.6260 2.7003 5.3586 1.4950 66.1609 2.7579 10.2376 1.4408 10.4519 1.3276 23.6232 1.0697 47.5358 9.5374 2.4757 12.3901 7.4385 18.5772 12.5912 17.7047 24.4299 39.8856 61.1382 17.6898 99.4060 5.8354 82.7501 68.8127 12.8903 85.0741 54.0386 209.0944 95.8935 46.5762 43.5795 10.0174 23.8442 0.6225 25.0066 6.6403 10.9129 17.9240 10.9138 44.1471 58.6509 30.3651 107.6899 224.0664 266.7028 35.0620 10.8654 7.9093 26.0413 51.8302 1.1241 68.1245 51.3990 120.4914 61.1464 25.6115 22.2945 2.4186 21.8120 7.7038 4.8668 13.1998 20.7486 0.3353 4.2835 16.4867 59.7407 4.8009 7.8193 22.6006 19.3832 81.1085 40.7980 19.5567 43.0608 23.3791 75.6257 8.1708 5.1984 134.8683 188.3394 65.8666 207.7875 58.8235 163.2056 110.0674 25.9986 4.5688 17.8227 2.9263 40.8664 8.4511 23.4922 4.2344 12.0459 8.0750 10.7659 3.3543 2.3445 5.6743 0.9141 12.1988 31.1823 6.1417 2.8341
temp: 298.150 k
press: 1.00000 atm
elementType: 16 9 8 8 8 8 8 8 7 7 7 6 6 6 6 6 6 6 6 6 6 6 6 1 1 1 1 1 1 1 1 1 1 1 1 1 1 1 1 1 1 1 1
symmnumber: 1
zpe: 870535.5 jmol-1
zpe.correction: 0.331569 hartree
zpe.thermalcorrener: 0.357857 hartree
zpe.thermalcorrenthalpy: 0.358801 hartree
zpe.thermalcorrgfe: 0.271985 hartree
zpe.sumelectzpe: -1580.984473 hartree
zpe.sumelectthermal: -1580.958185 hartree
zpe.sumelectthermalent: -1580.957241 hartree
zpe.sumelectthermalfe: -1581.044057 hartree
dipole: 1.7619 2.1715 -0.8117
dipole: 2.9118
quadrupole: -115.6511 -150.5119 -135.7258
quadrupole: -9.8937 -9.2187 -3.3335
quadrupole: 18.3118 -16.5490 -1.7629 -9.8937 -9.2187 -3.3335
hfenergy: -1581.3160424 hartree
pointgroup: C01 [X(C12H20F1N3O6S1)]
dipole: -0.6513206 0.6578482 0.6748221 debye
polarizability: 200.3578261|6.9034011|191.7487373|-9.0850312|10.8837334|168.148743 unknown
InChI: InChI=1S/C12H20FN3O6S/c13-3-4-23-6-8(15)11(20)16(5-10(18)19)9(17)2-1-7(14)12(21)22/h7-8,18,21H,1-6,14-15H2
charge 0 multiplicity 1
43 atoms
S  -2.536075 3.162689 0.766578
F  -0.166688 1.64652 -0.882798
O  0.303566 -2.752108 -0.879227
O  -0.514607 0.241532 1.914299
O  3.883266 0.794985 -2.23627
O  3.202374 1.984917 -0.363203
O  -3.448785 -2.590196 -2.318148
O  -2.235759 -0.60461 -2.329324
N  -1.119119 -1.318994 0.265175
N  -3.672076 -0.740224 1.913671
N  4.126834 -0.224501 1.313406
C  2.69963 -1.382566 -0.391105
C  1.409079 -0.932351 0.319653
C  -2.853622 0.277597 1.196926
C  3.886741 -0.407549 -0.121358
C  0.209174 -1.743115 -0.13019
C  -1.393163 -0.252986 1.152718
C  -2.924912 1.67015 1.868172
C  -2.219862 -2.099972 -0.336763
C  3.622028 0.916983 -0.86811
C  -2.584467 -1.646886 -1.742134
C  -0.644335 3.293536 0.869878
C  0.04187 3.04143 -0.465154
H  2.533802 -1.463644 -1.479648
H  3.002903 -2.379747 -0.029083
H  1.186867 0.13446 0.133371
H  1.510202 -1.025545 1.415944
H  -3.229194 0.359568 0.160355
H  4.785833 -0.858666 -0.5778
H  -3.967846 1.857308 2.180731
H  -2.271332 1.711033 2.755748
H  -1.91194 -3.156305 -0.395576
H  -3.101096 -2.029794 0.332158
H  -4.682052 -0.568371 1.861275
H  -3.364026 -0.908882 2.878144
H  3.391333 0.31251 1.785511
H  5.056231 0.144662 1.536249
H  -0.300547 2.577834 1.633362
H  -0.418389 4.321432 1.205668
H  1.136783 3.172111 -0.380149
H  -0.372059 3.668056 -1.275078
H  3.639494 1.638827 -2.706086
H  -3.692155 -2.291725 -3.235789
