program: Gaussian 09
title: 000179827
version: EM64L-G09RevD.01
frameworkgroup: C1[X(C18H15BrN2O3)]
method: RPBEPBE
basis: SDD
operation: Freq
keyword: #p
keyword: freq=noraman
keyword: PBEPBE/SDD
title: #p freq=noraman PBEPBE/SDD
converged: YES YES NO NO
title: Mulliken charges:
elementType: Br O O O N N C C C C C C C C C C C C C C C C C C H H H H H H H H H H H H H H H
charge: 0.027401 -0.264183 -0.286781 -0.415599 -0.402322 -0.366995 0.151925 -0.567160 0.252665 0.228581 -0.376771 0.533584 -0.320341 -0.046235 -0.373606 -0.351027 0.167981 -0.360681 -0.369356 -0.242481 -0.210501 -0.375719 -0.363120 0.406712 0.213793 0.217494 0.227315 0.253284 0.321580 0.317715 0.336674 0.285228 0.232891 0.253916 0.232217 0.226106 0.225608 0.221183 0.359024
chargesum: 0.00000
title: Mulliken charges with hydrogens summed into heavy atoms:
elementType: Br O O O N N C C C C C C C C C C C C C C C C C C
charge: 0.027401 -0.264183 -0.286781 -0.056574 -0.084607 -0.030322 0.151925 -0.135873 0.252665 0.228581 0.103828 0.533584 0.001238 -0.046235 -0.088377 -0.118136 0.167981 -0.106764 -0.137139 -0.016375 0.015107 -0.375719 -0.141937 0.406712
polarizability: 2.45583666e+02 -7.21705319e+01 2.31732768e+02 -1.46277596e+01 -3.35888552e+00 2.27486582e+02
1716.lowfreq: -6.1276 -0.5772 -0.0005 0.0002 0.0004 3.4425 3.8907 10.3761 13.2141
frequency: -4.5086 8.7250 13.0590 32.8547 60.4786 69.8883 84.2397 120.9488 128.5093 137.2766 174.9154 191.0058 207.7793 224.5461 246.7255 259.3391 284.0887 312.4612 336.0359 346.8377 358.1111 396.2379 424.2137 424.8767 434.5797 446.7850 464.9340 481.5876 508.1073 535.0866 575.3895 591.6336 600.8382 605.5298 638.4629 642.9982 662.2584 715.0229 722.8891 749.9599 756.4009 758.6609 761.8672 767.8280 799.5315 801.0307 837.5794 856.1624 866.4256 868.2529 879.9420 889.5956 919.0359 932.0684 948.6938 960.0442 990.0732 1010.8977 1023.4910 1043.6229 1057.3403 1088.1854 1117.0503 1123.8546 1145.7675 1162.5419 1167.3664 1183.5813 1211.0076 1221.8768 1238.4157 1242.1796 1247.3708 1259.1075 1285.8418 1291.8668 1325.9329 1355.7567 1359.4512 1387.2258 1391.9694 1400.3390 1427.4154 1449.7910 1460.3775 1463.2393 1481.0926 1488.1127 1495.6934 1498.1397 1572.8078 1576.9533 1591.9362 1614.7475 1619.8191 1632.6437 2979.6655 2990.7259 3041.1550 3070.6287 3111.8977 3129.8610 3140.1508 3142.0693 3150.5555 3161.0625 3184.3167 3244.9982 3450.0107 3581.0341 3595.5720
redmass: 9.8927 6.5658 6.5912 8.5658 6.8949 8.1163 6.8345 4.9311 6.0018 4.8676 5.9582 6.4998 5.0336 4.1595 5.7049 4.2026 5.3774 5.0985 1.1529 3.5471 4.2479 7.7610 3.3632 3.6873 3.1468 5.4337 3.5006 5.4535 4.5527 7.3317 3.9232 5.9326 2.2080 2.0325 5.3065 2.3197 6.7063 3.7645 3.5996 1.4486 2.7321 1.7393 2.8820 4.7752 1.5360 5.0602 5.0398 2.6648 3.6099 1.4221 1.8070 1.4298 2.7676 1.4225 1.3753 2.6938 1.3133 2.0872 3.0530 1.9810 4.4807 1.7694 1.5075 1.4592 1.8264 1.2002 1.1557 1.7437 1.9756 1.7131 1.3643 1.4464 2.6680 2.9644 1.4073 2.4467 1.3588 1.6498 1.8820 5.6431 5.5940 3.1425 2.5190 3.5826 1.1181 1.1999 2.7573 2.4483 3.3399 3.5234 6.6140 6.6627 6.6212 9.3340 6.9778 7.1563 1.0619 1.0626 1.1022 1.0987 1.0878 1.0859 1.0960 1.0914 1.0928 1.0975 1.0965 1.1002 1.0764 1.0660 1.0810
irintensity: 0.9755 0.0986 0.2089 2.9593 4.7497 1.7768 0.5464 1.0166 0.5347 2.0447 0.6691 3.2736 6.8418 10.5380 5.2317 5.2749 0.1658 24.4020 104.6166 24.0105 19.6183 7.4383 8.0345 6.7499 12.5829 7.2641 6.0672 14.8419 1.9239 6.0529 0.2218 10.9696 25.3071 65.6530 17.5250 22.7917 9.3367 6.0929 33.5020 42.1406 22.6035 156.0851 18.4308 29.8324 59.6093 0.5677 26.4434 7.6733 4.3244 1.2089 44.1592 12.5330 2.3326 0.2232 4.0680 14.1020 0.7262 10.6147 23.3775 25.0540 8.2939 36.3211 137.3876 43.2869 6.2763 54.6326 5.8460 32.3085 30.4070 11.1021 61.5423 7.2814 40.3170 49.6094 26.0548 2.9216 9.7788 23.8113 14.0427 15.2152 36.4216 19.9864 114.6597 33.1596 56.1416 104.1936 40.2759 171.9735 61.2315 152.1722 223.1076 18.2904 10.0219 127.3214 8.5812 8.1897 13.0310 104.8310 18.9556 15.6715 14.2889 0.2135 16.1028 18.4227 2.5225 28.9251 6.8258 24.6052 55.4330 41.2659 77.1339
temp: 298.150 k
press: 1.00000 atm
elementType: 35 8 8 8 7 7 6 6 6 6 6 6 6 6 6 6 6 6 6 6 6 6 6 6 1 1 1 1 1 1 1 1 1 1 1 1 1 1 1
symmnumber: 1
zpe: 768606.2 jmol-1
zpe.correction: 0.292747 hartree
zpe.thermalcorrener: 0.313174 hartree
zpe.thermalcorrenthalpy: 0.314118 hartree
zpe.thermalcorrgfe: 0.240027 hartree
zpe.sumelectzpe: -1041.888371 hartree
zpe.sumelectthermal: -1041.867944 hartree
zpe.sumelectthermalent: -1041.867000 hartree
zpe.sumelectthermalfe: -1041.941091 hartree
dipole: -0.0937 1.9074 3.8365
dipole: 4.2855
quadrupole: -124.8768 -148.4416 -126.3318
quadrupole: -19.5723 3.4307 -7.8297
quadrupole: 8.3399 -15.2249 6.8850 -19.5723 3.4307 -7.8297
hfenergy: -1042.181118 hartree
pointgroup: C01 [X(C18H15Br1N2O3)]
dipole: -0.3024674 0.0962769 1.6559154 debye
polarizability: 273.8602265|-54.9163834|216.5544314|-33.7731807|-15.1451099|214.3883577 unknown
InChI: InChI=1S/C18H15BrN2O3/c19-14-9-11(5-6-16(14)22)7-8-20-18(24)17(23)13-10-21-15-4-2-1-3-12(13)15/h1-6,9-10,20-22H,7-8H2
charge 0 multiplicity 1
39 atoms
Br -2.245897 -2.93323 -2.527714
O  1.133862 1.686396 -1.377772
O  -0.717989 1.230926 1.684959
O  -3.943763 -3.639519 -0.052402
N  2.993023 -0.757936 2.129554
N  -1.212658 2.303601 -0.338998
C  3.262213 0.082767 0.017848
C  -3.666247 2.073712 -0.863713
C  1.943184 0.466505 0.523503
C  3.899744 -0.684324 1.047958
C  -2.562981 2.741258 0.011934
C  -3.771084 0.571714 -0.656003
C  1.83165 -0.076887 1.823601
C  0.951556 1.245559 -0.187664
C  3.95304 0.314846 -1.196946
C  5.193955 -1.224092 0.911089
C  -0.405771 1.576569 0.500868
C  -3.106545 -0.331451 -1.523881
C  -4.504183 0.037271 0.432365
C  5.249955 -0.221238 -1.345026
C  5.863529 -0.979738 -0.307389
C  -3.17247 -1.72162 -1.308509
C  -4.573614 -1.352469 0.650106
C  -3.905819 -2.25052 -0.219692
H  -4.625863 2.563371 -0.606843
H  -3.466095 2.303135 -1.927989
H  -2.635827 3.841536 -0.096251
H  -2.714085 2.488314 1.076082
H  0.986224 0.004225 2.502895
H  3.167308 -1.24672 3.006386
H  -0.801206 2.508731 -1.2595
H  3.475895 0.895805 -1.989991
H  5.666341 -1.808771 1.707983
H  -2.532996 0.048145 -2.375838
H  -5.026044 0.71265 1.120359
H  5.79957 -0.053329 -2.277699
H  6.871711 -1.381395 -0.457165
H  -5.147985 -1.748802 1.497706
H  -4.478934 -3.880796 0.74419
