program: Gaussian 09
title: 000179810
version: EM64L-G09RevD.01
frameworkgroup: C1[X(C15H20O4)]
method: RPBEPBE
basis: SDD
operation: Freq
keyword: #pfreq=noraman
keyword: PBEPBE/SDD
title: #p freq=noraman PBEPBE/SDD
converged: YES YES NO NO
title: Mulliken charges:
elementType: O O O O C C C C C C C C C C C C C C C H H H H H H H H H H H H H H H H H H H H
charge: -0.250571 -0.284745 -0.232341 -0.251284 -0.363405 -0.332016 -0.314143 0.260645 0.099560 -0.697792 0.130995 -0.359112 -0.265833 -0.372668 -0.328920 0.185732 -0.218995 -0.222470 -0.683151 0.194201 0.250737 0.220505 0.186867 0.238931 0.209699 0.205330 0.224690 0.207078 0.216839 0.232703 0.230486 0.217469 0.260621 0.274706 0.238131 0.236770 0.219722 0.225220 0.209809
chargesum: 0.00000
title: Mulliken charges with hydrogens summed into heavy atoms:
elementType: O O O O C C C C C C C C C C C C C C C
charge: -0.250571 -0.284745 -0.232341 -0.251284 0.081533 0.075355 0.134488 0.260645 0.099560 -0.060693 0.130995 0.090429 0.182122 -0.112047 -0.054214 0.185732 0.019136 0.014300 -0.028399
polarizability: 2.27474748e+02 3.76326788e+00 1.93383277e+02 6.86893226e+00 7.21234401e+00 1.12498421e+02
1716.lowfreq: -8.8194 -5.7870 -0.0011 -0.0006 -0.0005 3.4804 11.1731 35.5982 35.8978
frequency: 10.2579 35.5788 35.8695 42.3181 48.7475 70.0259 78.5602 96.1258 97.1618 106.7583 148.7897 159.0315 183.5693 221.9294 224.5769 233.2327 264.9330 285.3691 296.0782 302.1341 326.3324 343.0371 396.9168 423.5746 459.7002 502.3296 527.1041 549.6039 640.4970 670.3247 673.4451 700.7954 720.4425 743.9936 760.0666 772.5324 785.9398 788.6722 818.3683 841.1172 876.1100 890.2193 894.1235 903.9104 932.9264 964.8473 974.4762 1003.0049 1016.7336 1028.3046 1036.6794 1046.0321 1065.3951 1072.2109 1119.3325 1125.0213 1128.1771 1141.3018 1161.7854 1177.4469 1227.6102 1232.2136 1244.3510 1248.0175 1251.2437 1278.4553 1290.7215 1292.8103 1308.0859 1313.7883 1357.0720 1364.3628 1367.4314 1380.6539 1384.1795 1395.0285 1428.1532 1451.1859 1453.3469 1454.8541 1469.1006 1472.4977 1477.4658 1479.7450 1481.4171 1484.7401 1489.1068 1578.3673 1601.6344 1616.5657 1623.2930 2967.7108 2971.5482 2976.9319 2979.2652 3004.3017 3021.1072 3022.7369 3030.4358 3050.4742 3055.4642 3063.8472 3073.1652 3075.8407 3083.7120 3097.4003 3101.5181 3137.2971 3151.9482 3166.6758 3182.1973
redmass: 3.7389 6.9247 3.1511 3.0551 4.0671 2.0967 2.3081 3.1619 3.2836 4.2300 4.1122 4.8015 4.3139 2.1648 1.4050 1.2109 3.2492 3.6886 3.2867 3.5685 5.7243 6.0510 3.0209 3.8600 5.3589 2.9114 5.1355 4.0561 6.2422 5.7570 5.4132 4.9759 1.4447 2.0095 1.5685 2.4550 1.8098 3.0552 2.3102 2.0490 2.2229 1.2658 1.5526 1.7176 3.8131 1.3422 1.4002 1.3486 3.3004 4.6512 4.1944 2.9886 2.1914 2.9023 1.9889 2.0304 2.0158 2.0514 1.7132 1.0621 2.9375 1.4360 1.6253 1.7977 1.2643 1.5365 1.1111 1.1240 1.3151 1.2438 1.2919 1.5681 1.4153 9.9930 1.2212 1.2043 2.1781 1.0813 1.1040 1.1130 1.0687 1.0470 2.5522 1.0537 1.0470 1.0608 1.0859 7.2988 6.6467 9.3205 10.2533 1.0404 1.0589 1.0648 1.0360 1.0602 1.0570 1.0592 1.0919 1.1005 1.0980 1.0990 1.1013 1.1020 1.0990 1.1083 1.1085 1.0862 1.0913 1.0971 1.0971
irintensity: 0.1519 1.1247 0.2022 0.4042 0.7992 0.7690 1.8920 0.2423 0.9059 0.8310 1.6068 0.3055 0.1316 3.2147 1.1535 0.2319 0.6526 0.2553 8.2812 11.2046 3.5234 11.5121 6.2253 0.5882 5.8683 3.7880 0.6075 4.4614 5.7542 5.8377 6.1929 47.5850 28.3252 26.2564 3.9665 4.9005 31.7399 8.0812 12.6456 3.4739 8.2382 0.6725 11.7881 6.4597 16.4144 9.0206 3.2886 1.1078 30.1610 118.2877 138.6659 5.8632 32.2367 194.3466 23.5182 17.0082 3.7880 21.4198 14.0459 0.8893 118.6372 27.7833 156.2619 144.0385 31.1314 25.3598 6.2456 2.0997 8.1283 1.0375 3.7396 1.2026 3.4625 10.4430 12.9364 10.8972 6.8590 22.6029 13.2808 20.7264 0.7137 11.3283 14.8471 6.5168 11.4082 13.0800 19.5370 30.2023 41.9420 211.6524 105.1684 41.6175 23.9812 30.6952 36.2312 8.3098 55.4663 37.5483 4.1817 0.6673 7.6707 68.9338 110.2677 17.5069 38.5210 17.0404 38.7292 1.6377 10.0625 16.2140 9.9641
temp: 298.150 k
press: 1.00000 atm
elementType: 8 8 8 8 6 6 6 6 6 6 6 6 6 6 6 6 6 6 6 1 1 1 1 1 1 1 1 1 1 1 1 1 1 1 1 1 1 1 1
symmnumber: 1
zpe: 841303.5 jmol-1
zpe.correction: 0.320436 hartree
zpe.thermalcorrener: 0.340920 hartree
zpe.thermalcorrenthalpy: 0.341864 hartree
zpe.thermalcorrgfe: 0.267939 hartree
zpe.sumelectzpe: -883.059056 hartree
zpe.sumelectthermal: -883.038572 hartree
zpe.sumelectthermalent: -883.037628 hartree
zpe.sumelectthermalfe: -883.111553 hartree
dipole: 0.7817 -2.5461 -2.0746
dipole: 3.3760
quadrupole: -97.1382 -102.9917 -119.7043
quadrupole: 3.9087 4.3743 -6.2564
quadrupole: 9.4732 3.6197 -13.0929 3.9087 4.3743 -6.2564
hfenergy: -883.3794917 hartree
pointgroup: C01 [X(C15H20O4)]
dipole: -0.6456636 0.9056234 -0.7260443 debye
polarizability: 220.4838926|14.6068977|201.3469032|-1.6641025|0.5088329|111.5256502 unknown
InChI: InChI=1S/C15H20O4/c1-3-5-11-19-15(17)13-9-7-6-8-12(13)14(16)18-10-4-2/h6-9H,3-5,10-11H2,1-2H3
charge 0 multiplicity 1
39 atoms
O  1.092652 -1.4695 -0.956576
O  -1.382982 1.902806 0.325557
O  2.467067 -1.782472 0.91046
O  -0.69423 -0.219663 1.011372
C  -0.447587 -3.316765 -0.298882
C  -1.718831 -2.798571 -1.00593
C  0.851215 -2.949331 -1.027523
C  2.031378 0.472125 0.07972
C  0.953383 1.395347 0.202475
C  -2.994692 -3.044636 -0.174175
C  1.869372 -1.025731 0.110101
C  -3.53537 1.028851 -0.572102
C  -2.795046 1.553946 0.665489
C  3.348837 0.96055 -0.089252
C  1.211704 2.787049 0.102452
C  -0.420172 0.913347 0.543805
C  3.597155 2.346964 -0.181495
C  2.523296 3.262658 -0.09726
C  -5.020402 0.745455 -0.253464
H  -0.488989 -4.422979 -0.215745
H  -0.401508 -2.916608 0.730727
H  -1.599362 -1.714604 -1.191423
H  -1.81422 -3.285605 -1.998689
H  1.723452 -3.462235 -0.58531
H  0.791924 -3.150528 -2.110698
H  -3.136072 -4.122163 0.035637
H  -2.927954 -2.516579 0.795371
H  -3.898381 -2.683442 -0.700427
H  -3.454512 1.773484 -1.386065
H  -3.042768 0.103483 -0.922453
H  -2.79062 0.803912 1.476809
H  -3.226898 2.503563 1.02436
H  4.174462 0.244757 -0.154231
H  0.373285 3.481253 0.200294
H  4.621879 2.708348 -0.3186
H  2.709169 4.339264 -0.170893
H  -5.121524 -0.024191 0.534227
H  -5.548416 0.378526 -1.151254
H  -5.540999 1.658113 0.09289
