program: Gaussian 09
title: 000179786
version: EM64L-G09RevD.01
frameworkgroup: C1[X(C16H22O3)]
method: RPBEPBE
basis: SDD
operation: Freq
keyword: #pfreq=noraman
keyword: PBEPBE/SDD
title: #p freq=noraman PBEPBE/SDD
converged: YES YES NO NO
title: Mulliken charges:
elementType: O O O C C C C C C C C C C C C C C C C H H H H H H H H H H H H H H H H H H H H H H
charge: -0.305713 -0.242521 -0.267317 0.243666 0.067795 0.448697 -0.234048 -0.722026 -0.692207 -0.091452 -0.345785 -0.007332 0.254030 -0.277960 -0.458132 -0.372501 -0.694797 -0.700105 -0.522131 0.228776 0.237026 0.232724 0.203811 0.211596 0.232572 0.242239 0.222873 0.235415 0.208858 0.193615 0.230978 0.250993 0.210228 0.194341 0.253239 0.223437 0.212691 0.204135 0.252347 0.226595 0.211353
chargesum: 0.00000
title: Mulliken charges with hydrogens summed into heavy atoms:
elementType: O O O C C C C C C C C C C C C C C C C
charge: -0.305713 -0.242521 -0.267317 0.243666 0.067795 0.448697 -0.005272 -0.048464 -0.005800 0.131421 -0.110370 -0.007332 0.254030 0.124512 -0.227155 -0.121508 -0.036990 -0.059843 0.168163
polarizability: 2.86202112e+02 3.95994233e+00 1.85232404e+02 -2.04882728e+00 5.81420148e+00 1.20456925e+02
1716.lowfreq: -5.6825 -1.8880 -0.0004 0.0005 0.0005 6.8379 25.2474 44.0758 54.4159
frequency: 25.0835 43.9510 54.3504 66.2078 79.4007 85.7688 112.2361 145.5519 156.5245 176.5609 180.5716 202.3514 212.3834 217.7589 225.7077 228.8304 240.8767 257.3748 301.4298 304.2817 340.7753 372.6131 379.0054 396.1531 413.0463 435.6925 461.8049 483.6604 511.9199 529.8858 558.7940 592.3947 641.2309 647.7089 680.7197 726.1047 741.2942 762.2597 777.4666 798.3324 833.1722 856.4039 901.0733 911.8568 917.6378 923.0278 925.1714 937.1750 945.0945 958.4419 962.0024 971.9342 995.8341 1019.1465 1067.6194 1109.1628 1121.0885 1137.1804 1148.8364 1154.5426 1162.9067 1179.9980 1191.7582 1195.3237 1223.0651 1233.1412 1237.3249 1249.0696 1263.5741 1297.6976 1345.8179 1362.5306 1370.5808 1376.8683 1379.0981 1386.3899 1396.2403 1398.2648 1418.2318 1433.7028 1448.8679 1457.2825 1458.9743 1461.7840 1466.1849 1470.5508 1472.0137 1479.5617 1481.0375 1482.3147 1486.1474 1492.3357 1557.4099 1607.9488 1642.9776 2936.8682 2968.9564 2969.6967 2974.1797 2984.2063 2990.6589 2993.6427 3010.4519 3060.1584 3068.1618 3070.0816 3077.2417 3083.5112 3093.9647 3094.7493 3095.8405 3103.3531 3116.2696 3118.4637 3129.5827 3146.2760 3171.8713
redmass: 3.9018 2.6601 3.5139 3.1993 3.1386 3.1652 3.9977 2.7757 1.3626 1.9012 1.1256 1.2703 2.7849 2.5958 1.1866 2.6061 1.4186 2.6412 2.8227 3.1754 4.0023 2.5566 3.5052 3.8791 2.9352 2.2223 3.8048 4.9783 4.8057 3.8590 4.7096 5.4523 3.6104 6.2307 5.0504 1.7041 6.4457 4.3047 4.3188 1.6752 2.5546 2.8770 3.1112 1.4453 1.6528 1.7392 1.2402 1.7820 2.1879 1.3413 1.8547 1.8237 1.3218 5.1703 3.1905 1.2369 1.6905 1.9379 1.7609 1.4232 1.6437 1.7754 1.9312 3.2661 2.6816 1.4228 1.5405 2.3875 3.5644 1.3694 1.4264 1.7515 1.2323 1.3591 1.5971 2.1967 1.4908 1.3287 2.0149 1.8086 1.0524 1.0687 1.0591 1.1438 1.0809 1.0460 1.2651 1.0688 1.0700 1.0509 1.6431 1.1317 7.5067 7.6667 7.6190 1.0551 1.0325 1.0361 1.0383 1.0346 1.0892 1.0353 1.1004 1.0991 1.0987 1.1010 1.0987 1.0996 1.0999 1.1004 1.0991 1.1007 1.0854 1.1030 1.0894 1.0995 1.0935
irintensity: 1.0436 0.0186 0.3627 1.6891 5.4179 2.6704 0.7819 3.5884 0.2200 1.1316 0.0777 0.3749 1.3531 3.1255 0.3606 1.2856 0.5498 0.9830 2.0896 8.4756 2.6058 0.5101 2.9071 1.0602 0.3984 2.9319 0.5766 7.0553 0.2956 1.3325 0.3197 3.6935 18.8417 7.3638 9.4328 9.8966 3.9040 8.0730 10.6871 56.9582 4.8735 12.0731 16.0065 0.4934 1.5125 6.9416 3.1102 3.2512 22.3241 2.3444 4.2199 15.6928 1.7387 168.8144 293.3423 6.6543 111.3968 1.3034 0.6096 4.0615 41.1890 37.8263 33.8236 12.2768 26.8971 55.1612 22.9902 7.6603 190.7449 0.0879 1.3132 8.1095 24.3267 49.2539 16.8954 3.9130 23.4594 48.5928 22.7129 42.1855 5.3854 1.7152 2.9695 48.6311 4.4133 1.7034 65.5949 11.3220 8.2182 10.6264 90.7820 6.7847 21.5179 139.3719 38.3197 44.0700 73.8987 37.8576 37.9577 16.0575 7.1664 24.9474 39.7330 22.6073 64.0355 34.2911 55.6254 8.1421 25.9708 23.3012 31.6484 29.2410 3.5603 24.1693 11.8752 27.1104 15.6796
temp: 298.150 k
press: 1.00000 atm
elementType: 8 8 8 6 6 6 6 6 6 6 6 6 6 6 6 6 6 6 6 1 1 1 1 1 1 1 1 1 1 1 1 1 1 1 1 1 1 1 1 1 1
symmnumber: 1
zpe: 898333.5 jmol-1
zpe.correction: 0.342157 hartree
zpe.thermalcorrener: 0.362710 hartree
zpe.thermalcorrenthalpy: 0.363654 hartree
zpe.thermalcorrgfe: 0.293066 hartree
zpe.sumelectzpe: -847.081130 hartree
zpe.sumelectthermal: -847.060577 hartree
zpe.sumelectthermalent: -847.059633 hartree
zpe.sumelectthermalfe: -847.130221 hartree
dipole: 0.3841 -1.4898 -0.8862
dipole: 1.7755
quadrupole: -92.7936 -107.2361 -116.9515
quadrupole: 3.4810 0.7396 -1.6012
quadrupole: 12.8669 -1.5757 -11.2911 3.4810 0.7396 -1.6012
hfenergy: -847.4232872 hartree
pointgroup: C01 [X(C16H22O3)]
dipole: -0.1576668 0.6037021 -0.3140579 debye
polarizability: 285.3535482|7.1027088|186.0784035|9.3574765|-0.8946548|120.4594892 unknown
InChI: InChI=1S/C16H22O3/c1-11(2)10-18-13-7-6-12-8-9-16(3,4)19-14(12)15(13)17-5/h6-9,11H,10H2,1-5H3
charge 0 multiplicity 1
41 atoms
O  -2.300538 -0.940022 -0.254085
O  2.40506 -0.174805 0.307749
O  0.312475 -1.880061 0.276493
C  -3.701333 -0.458799 0.074634
C  -1.253975 -0.011034 -0.140213
C  -1.492357 1.388245 -0.300513
C  -3.909673 0.955617 -0.451939
C  -4.61129 -1.481423 -0.623731
C  -3.853362 -0.507343 1.613462
C  4.811804 -0.155091 0.615071
C  -2.863535 1.820767 -0.577532
C  0.053429 -0.517988 0.053866
C  1.147824 0.401352 0.11323
C  3.570052 0.724184 0.399306
C  -0.390964 2.271439 -0.23482
C  0.917993 1.795374 -0.022488
C  5.030448 -1.11727 -0.573669
C  6.045849 0.746468 0.854247
C  -0.000905 -2.78742 -0.846988
H  -4.938677 1.255467 -0.681726
H  -4.467371 -1.44627 -1.716767
H  -4.379726 -2.500442 -0.268779
H  -5.670795 -1.2637 -0.398261
H  -4.871522 -0.193197 1.907752
H  -3.675205 -1.533509 1.9810
H  -3.130584 0.173515 2.095417
H  4.628793 -0.759646 1.525636
H  -3.025128 2.854121 -0.90757
H  3.430323 1.425817 1.248252
H  3.665621 1.310569 -0.540391
H  -0.563718 3.347299 -0.355856
H  1.749467 2.503008 0.023042
H  5.894399 -1.780832 -0.385995
H  5.232733 -0.551691 -1.504513
H  4.136485 -1.742918 -0.73562
H  6.945174 0.129281 1.02973
H  5.910404 1.404902 1.733118
H  6.247029 1.386798 -0.026622
H  -1.077539 -2.754959 -1.088502
H  0.283456 -3.790189 -0.49274
H  0.598879 -2.520414 -1.738785
