program: Gaussian 09
title: 000179798
version: EM64L-G09RevD.01
frameworkgroup: C1[X(C12H17O6P)]
method: RPBEPBE
basis: SDD
operation: Freq
keyword: #p
keyword: freq=noraman
keyword: PBEPBE/SDD
title: #p freq=noraman PBEPBE/SDD
converged: YES YES NO NO
title: Mulliken charges:
elementType: P O O O O O O C C C C C C C C C C C C H H H H H H H H H H H H H H H H H
charge: 1.401849 -0.295438 -0.564101 -0.499572 -0.672721 -0.259517 -0.582017 0.041569 0.103965 0.250445 -0.683266 -0.680789 0.209311 -0.312247 -0.337803 -0.240040 -0.204391 -0.251130 -0.659541 0.232386 0.209604 0.235165 0.221562 0.215587 0.249066 0.219832 0.270632 0.298421 0.235874 0.237977 0.234844 0.291909 0.209631 0.233116 0.233766 0.406063
chargesum: 0.00000
title: Mulliken charges with hydrogens summed into heavy atoms:
elementType: P O O O O O O C C C C C C C C C C C C
charge: 1.401849 -0.295438 -0.564101 -0.499572 -0.266658 -0.259517 -0.582017 0.273955 0.103965 0.250445 -0.016936 0.003695 0.209311 -0.041615 -0.039382 -0.004166 0.033587 0.275623 0.016973
polarizability: 2.06730965e+02 7.25209260e+00 2.05179254e+02 6.24594163e+00 -1.30102845e+01 1.24059430e+02
1716.lowfreq: -24.3677 -5.5479 -0.0014 -0.0008 0.0006 3.7392 7.4856 18.3708 33.2481
frequency: -23.7934 18.3386 33.1860 45.6419 54.7956 66.3041 70.1753 94.8271 108.5190 125.4587 128.1661 143.9622 177.2003 186.1875 204.7024 225.0766 246.1272 252.1592 265.7621 280.2843 287.6869 320.0217 347.3158 366.7373 386.4240 395.6333 420.5168 433.3420 456.9708 492.2453 527.5641 559.4616 611.2936 647.0457 679.2420 682.4917 723.3380 759.3442 774.1479 788.3610 791.5907 820.0787 851.6854 867.3089 887.9382 903.5747 925.8231 939.6608 970.1370 995.9296 1005.4164 1008.4979 1029.1840 1044.2989 1077.0054 1100.6866 1107.6682 1125.7247 1141.3610 1156.8652 1176.5046 1181.0919 1193.8238 1233.5745 1262.5053 1276.4054 1326.0349 1336.0564 1376.7993 1379.2300 1380.1740 1396.0862 1396.4669 1426.5863 1456.6375 1457.0746 1464.0757 1472.0130 1474.7160 1479.7280 1486.0665 1498.2635 1578.7013 1597.2664 1615.0757 2988.9498 2993.1411 2994.4757 3014.6595 3028.9895 3083.8094 3084.3397 3090.6045 3093.4902 3099.1125 3104.1715 3114.7925 3140.0263 3156.0361 3167.6383 3182.6238 3592.5203
redmass: 2.3860 4.3960 2.4814 2.6381 5.2402 4.2797 4.6164 4.3145 2.3898 4.6586 3.7210 4.6709 5.5037 1.0332 3.3122 1.2273 1.4814 3.2518 5.1895 2.9568 4.3250 5.1354 4.7808 4.3830 6.9836 3.6238 4.2938 4.8314 3.0647 4.6795 4.4509 5.6076 7.8503 6.8441 5.4531 7.1305 7.7920 3.4106 1.9880 2.3166 7.7624 1.0822 6.0362 5.0259 1.4206 2.7202 1.2502 1.3357 1.3749 1.3370 2.2315 1.4229 6.3820 2.2519 6.2796 1.7499 2.4464 1.9637 1.4227 2.0718 1.1239 1.9746 2.8187 3.0801 1.1440 1.4662 1.4948 1.3318 1.2086 4.8997 1.4631 1.2402 1.2443 2.1830 1.0399 1.0523 1.0480 1.0999 2.2029 1.0500 1.0511 1.0870 7.0119 7.4893 8.9315 1.0357 1.0359 1.0360 1.0576 1.0864 1.0995 1.1083 1.0974 1.0987 1.1006 1.1005 1.1044 1.0867 1.0914 1.0970 1.0977 1.0659
irintensity: 50.2571 0.1832 15.0810 16.7145 0.7602 8.4998 0.4840 13.6038 6.2377 3.4527 5.4670 1.1539 1.8451 0.0080 5.8719 1.0108 2.5748 8.5965 21.6833 27.1541 8.6696 14.4214 34.7018 6.4206 35.0570 7.2654 17.2356 17.9008 2.0983 33.5797 0.6467 7.6993 21.4349 20.5933 34.6220 113.3321 203.9977 36.9311 58.3897 21.3022 34.7273 3.0270 132.5391 152.7020 6.1758 18.4461 2.5488 0.1988 3.8723 2.3726 153.0579 107.9064 370.7766 71.4600 70.0079 107.7601 22.7956 40.8831 9.0627 12.7331 10.3938 38.7931 92.1318 313.7840 3.5044 12.6863 6.7750 3.2650 0.6998 8.5137 27.8236 16.3080 28.4506 29.4030 12.6116 5.7188 4.6965 0.4650 101.4635 6.1919 17.2107 9.1336 21.2555 35.6769 272.1613 14.9073 24.6500 17.5271 34.1062 5.7885 4.9000 8.8207 20.7292 56.8832 17.8317 30.6738 22.2682 4.5434 8.4951 6.7739 10.6530 72.1678
temp: 298.150 k
press: 1.00000 atm
elementType: 15 8 8 8 8 8 8 6 6 6 6 6 6 6 6 6 6 6 6 1 1 1 1 1 1 1 1 1 1 1 1 1 1 1 1 1
symmnumber: 1
zpe: 723662.0 jmol-1
zpe.correction: 0.275628 hartree
zpe.thermalcorrener: 0.296691 hartree
zpe.thermalcorrenthalpy: 0.297635 hartree
zpe.thermalcorrgfe: 0.224021 hartree
zpe.sumelectzpe: -1258.590394 hartree
zpe.sumelectthermal: -1258.569332 hartree
zpe.sumelectthermalent: -1258.568387 hartree
zpe.sumelectthermalfe: -1258.642002 hartree
dipole: -5.9801 -0.7955 0.2012
dipole: 6.0362
quadrupole: -128.0469 -105.5799 -114.8086
quadrupole: -0.7142 1.8826 -2.0674
quadrupole: -11.9017 10.5652 1.3365 -0.7142 1.8826 -2.0674
hfenergy: -1258.8660224 hartree
pointgroup: C01 [X(C12H17O6P1)]
dipole: 2.3112819 -0.3712864 0.3998436 debye
polarizability: 201.0818242|-5.7618878|207.4575249|21.9133895|-2.3352328|127.4302999 unknown
InChI: InChI=1S/C12H17O6P/c1-4-16-19(14,15)18-11-8-6-5-7-10(11)12(13)17-9(2)3/h5-9,14H,4H2,1-3H3
charge 0 multiplicity 1
36 atoms
P  -3.022256 -0.21917 -0.859443
O  2.637977 -0.163348 0.381668
O  -1.306644 0.18569 -0.969406
O  -3.262029 -1.149666 0.540067
O  -2.954944 -1.396847 -2.108589
O  0.647839 -1.37322 0.33567
O  -4.029854 0.98939 -0.997739
C  3.411703 -1.446722 0.562782
C  0.616615 1.085439 0.214203
C  -0.686917 1.281108 -0.327464
C  4.793395 -1.168714 -0.032551
C  3.432087 -1.80504 2.05579
C  1.245075 -0.267117 0.302239
C  1.30478 2.218157 0.72961
C  -1.298136 2.556382 -0.318193
C  0.703434 3.490883 0.745906
C  -0.604124 3.654409 0.23075
C  -2.486289 -2.433974 0.744928
C  -2.819587 -2.87706 2.163895
H  2.87513 -2.228369 -0.006428
H  5.421163 -2.075483 0.036436
H  4.712879 -0.879228 -1.094024
H  5.298822 -0.353246 0.514291
H  4.019057 -2.728694 2.211598
H  2.410514 -1.979788 2.432872
H  3.899194 -0.994853 2.643507
H  2.313064 2.070924 1.125158
H  -2.302973 2.675154 -0.735752
H  1.245962 4.347408 1.158202
H  -1.083518 4.639122 0.243363
H  -2.834261 -3.15409 -0.016063
H  -1.411557 -2.220684 0.607417
H  -2.305701 -3.832888 2.378222
H  -2.482406 -2.126899 2.898671
H  -3.905414 -3.028195 2.286381
H  -2.240778 -1.230576 -2.775675
