program: Gaussian 09
title: 000179811
version: EM64L-G09RevD.01
frameworkgroup: C1[X(C17H27NO4)]
method: RPBEPBE
basis: SDD
operation: Freq
keyword: #p
keyword: freq=noraman
keyword: PBEPBE/SDD
title: #p freq=noraman PBEPBE/SDD
converged: YES YES NO NO
title: Mulliken charges:
elementType: O O O O N C C C C C C C C C C C C C C C C C H H H H H H H H H H H H H H H H H H H H H H H H H H H
charge: -0.307137 -0.476747 -0.250112 -0.290471 -0.336177 -0.115252 -0.450329 -0.025469 -0.277293 0.347685 0.247285 -0.549953 -0.719569 -0.658232 -0.500760 -0.409575 -0.365982 -0.251596 -0.234695 0.293974 -0.263555 -0.662630 0.195531 0.229983 0.221392 0.186127 0.249209 0.223087 0.223039 0.229805 0.230363 0.215877 0.207580 0.222608 0.198842 0.217777 0.217155 0.239121 0.269238 0.234489 0.384661 0.250595 0.225393 0.223878 0.224500 0.235791 0.218828 0.253254 0.228465
chargesum: 0.00000
title: Mulliken charges with hydrogens summed into heavy atoms:
elementType: O O O O N C C C C C C C C C C C C C C C C C
charge: -0.307137 -0.092086 -0.250112 -0.290471 -0.086968 0.080279 0.001046 0.160658 0.168833 0.347685 0.247285 -0.089784 -0.073503 -0.024458 0.007599 -0.175086 -0.115387 -0.026203 -0.010817 0.293974 0.196737 0.037917
polarizability: 2.21211450e+02 -1.34109481e+01 2.36480825e+02 -2.15941515e+01 -1.15210492e+01 1.66408818e+02
1716.lowfreq: -14.9522 -8.0254 -4.1472 -0.0006 -0.0001 0.0005 9.5216 17.7456 28.9476
frequency: 4.6840 17.5059 28.6326 32.5180 43.4441 47.5583 62.9940 79.9451 91.2359 102.1374 113.3305 122.3702 157.0792 164.5689 178.0256 194.1231 205.6756 222.4879 225.1182 245.0154 280.0683 285.6513 303.1335 317.3539 326.3346 374.0770 379.8164 420.2504 440.4342 447.7301 455.0636 462.7468 488.4484 514.6706 548.5546 578.1701 621.3040 633.1306 664.5493 675.2903 704.4799 735.8518 748.7158 755.9646 776.6486 800.0792 812.0598 822.8583 832.8333 842.3709 855.9968 911.4159 915.6349 922.9302 933.7883 935.4156 951.1272 960.1945 972.0408 982.3516 994.1871 1015.9222 1020.2768 1042.5302 1081.0375 1086.9718 1095.6625 1098.5127 1105.8699 1134.4233 1139.7255 1156.9083 1157.6640 1171.1274 1179.4713 1193.4082 1211.8321 1218.4370 1237.3982 1245.9926 1268.7808 1273.9698 1276.6803 1286.4403 1305.8432 1315.9155 1330.5839 1332.9359 1342.0787 1356.1195 1357.5778 1366.3238 1375.6003 1381.3645 1389.9222 1390.5723 1391.7062 1438.7597 1445.5058 1448.7778 1449.1456 1455.8571 1462.6637 1465.1533 1466.4162 1467.4351 1477.1073 1481.4665 1485.0684 1487.2714 1490.6269 1592.9610 1602.6263 1609.5872 2855.5059 2918.1912 2972.8595 2974.2494 2980.7969 2994.0555 3001.8868 3002.3826 3031.9140 3041.3937 3048.7510 3053.7287 3065.0125 3065.3649 3076.4440 3083.3004 3088.6028 3089.2685 3095.4792 3117.0267 3119.5277 3121.5081 3133.4322 3155.9176 3169.7157 3334.0110 3425.1469
redmass: 4.3971 4.1677 2.7436 3.5018 3.2738 4.3374 4.1117 4.0520 3.6429 3.0528 4.3395 4.3101 3.9883 5.3018 2.7347 1.5959 3.3572 1.2851 2.0815 1.1071 3.2534 2.4484 2.5306 3.6345 2.8354 3.2270 2.5051 2.3303 3.1319 2.8081 3.1671 3.5209 3.2418 3.5990 3.8753 5.1282 3.4661 3.2295 1.4022 1.2620 4.7778 2.7270 2.5788 1.4795 2.4966 1.6287 2.3471 2.0328 2.5511 2.4805 1.7077 2.8935 1.2203 2.1369 1.9123 1.5524 1.5450 2.9771 1.3828 3.8428 2.0141 3.0076 2.3413 2.1115 2.3889 2.7652 2.1068 1.9458 2.0219 2.0855 1.5900 1.7462 1.6842 1.0998 1.9659 2.4290 1.5989 1.3294 3.0046 1.1560 1.2324 1.2658 1.1403 1.4397 1.4010 1.3677 1.2808 1.4753 1.4618 1.2926 1.3516 1.3513 1.2362 1.2217 1.3111 4.1323 1.2361 1.9189 1.1293 1.1828 1.1759 1.1035 1.1107 1.0439 1.1190 1.0646 1.0847 1.1354 1.0526 2.0366 1.0874 6.9628 7.8791 6.5757 1.0824 1.0699 1.0361 1.0557 1.0354 1.0361 1.0613 1.0820 1.0593 1.0590 1.1082 1.0910 1.0988 1.1015 1.0989 1.0997 1.0992 1.0973 1.1034 1.1048 1.0883 1.1064 1.0887 1.0942 1.0984 1.0695 1.0742
irintensity: 0.5915 0.2521 0.4605 0.4762 0.6734 0.6178 0.5570 1.2033 0.2996 1.8206 2.0646 0.3677 1.1408 2.1814 3.1585 0.4373 6.4322 10.7305 3.0488 0.7170 0.1122 3.8578 13.3306 7.2840 7.7523 8.2312 2.9991 7.3071 2.2890 10.6628 3.7452 7.8229 2.4659 12.4161 2.0456 0.5610 4.1217 11.8297 26.2492 185.3882 5.2566 10.2185 8.5948 88.7644 2.2367 4.6214 1.2729 8.7381 5.6769 2.7794 1.8564 17.9874 6.2505 25.9534 6.1190 4.1374 9.1696 33.4633 1.3081 10.8748 1.6178 90.3768 24.7037 12.7800 81.1062 3.5125 61.9131 25.3079 78.1819 19.4134 131.7316 35.4226 11.0129 9.5148 47.3225 32.4391 156.1701 15.8793 122.1971 5.9914 2.6326 39.9143 4.5653 69.2642 70.3618 17.5526 6.2342 17.1512 9.7610 3.1775 11.7084 11.2755 48.8893 24.4540 34.8077 8.8785 17.3320 63.6975 18.8221 22.6451 11.7766 15.3928 2.0551 13.4779 16.1795 1.1482 8.4439 13.5534 12.1224 55.5111 16.3934 3.1519 176.7239 98.9635 88.3001 80.0740 38.9855 19.9217 16.4483 20.5333 32.2410 59.2299 27.4868 13.2702 23.7842 29.9300 38.6677 13.3083 40.7860 22.5161 58.7974 38.7142 0.6950 5.2471 9.6982 34.8455 12.2712 32.4436 14.6171 475.7061 1.9507
temp: 298.150 k
press: 1.00000 atm
elementType: 8 8 8 8 7 6 6 6 6 6 6 6 6 6 6 6 6 6 6 6 6 6 1 1 1 1 1 1 1 1 1 1 1 1 1 1 1 1 1 1 1 1 1 1 1 1 1 1 1
symmnumber: 1
zpe: 1090992.2 jmol-1
zpe.correction: 0.415537 hartree
zpe.thermalcorrener: 0.440108 hartree
zpe.thermalcorrenthalpy: 0.441053 hartree
zpe.thermalcorrgfe: 0.356719 hartree
zpe.sumelectzpe: -1017.919287 hartree
zpe.sumelectthermal: -1017.894716 hartree
zpe.sumelectthermalent: -1017.893772 hartree
zpe.sumelectthermalfe: -1017.978105 hartree
dipole: 0.5758 -0.2140 -2.1918
dipole: 2.2762
quadrupole: -113.3313 -125.7614 -136.6120
quadrupole: -1.4024 -9.2680 6.4687
quadrupole: 11.9036 -0.5265 -11.3771 -1.4024 -9.2680 6.4687
hfenergy: -1018.3348241 hartree
pointgroup: C01 [X(C17H27N1O4)]
dipole: 0.3182756 0.1540929 0.8227587 debye
polarizability: 226.8302323|14.4250742|230.6759239|13.1095991|-21.5670362|166.5949367 unknown
InChI: InChI=1S/C17H27NO4/c1-4-21-17(20)10-9-14-7-5-6-8-16(14)22-12-15(19)11-18-13(2)3/h5-8,13,15,18-19H,4,9-12H2,1-3H3
charge 0 multiplicity 1
49 atoms
O  -0.685032 -0.62954 -0.503276
O  0.047039 1.397844 -2.420343
O  4.152248 0.341847 0.345217
O  2.310559 1.312597 -0.687023
N  -2.861349 2.320785 -0.189705
C  -1.283952 1.297257 -1.833975
C  -1.446074 2.241455 -0.615532
C  -3.114254 2.766365 1.209722
C  -1.668215 -0.151879 -1.494398
C  0.334386 -2.346097 0.788459
C  -0.758229 -1.949628 -0.04202
C  1.446723 -1.34839 1.05209
C  -4.590055 3.198413 1.330179
C  -2.792945 1.629677 2.205497
C  2.317678 -1.108132 -0.236232
C  0.333924 -3.655499 1.313223
C  -1.808743 -2.846169 -0.344936
C  -0.714384 -4.563533 1.024322
C  -1.779486 -4.154008 0.193693
C  2.898136 0.28675 -0.245073
C  4.814802 1.686723 0.415532
C  5.580972 1.97684 -0.87726
H  -1.971654 1.629889 -2.63713
H  -1.008195 3.227662 -0.893551
H  -0.843732 1.841134 0.219208
H  -2.474241 3.647317 1.470081
H  -3.415497 2.878319 -0.855073
H  -1.61142 -0.788452 -2.398739
H  -2.686784 -0.168032 -1.059525
H  0.998154 -0.383972 1.354917
H  2.097094 -1.692629 1.875146
H  -4.824936 3.505035 2.364719
H  -4.816469 4.052902 0.663177
H  -5.25407 2.3577 1.055935
H  -2.924839 1.976794 3.247316
H  -1.753333 1.271993 2.096214
H  -3.465327 0.771419 2.02572
H  3.120257 -1.860898 -0.293901
H  1.668145 -1.19352 -1.121219
H  1.166561 -3.968137 1.955402
H  0.756203 1.297627 -1.718213
H  -2.641147 -2.5360 -0.983015
H  -0.696778 -5.575549 1.442102
H  -2.594232 -4.849031 -0.038727
H  5.484009 1.595455 1.285692
H  4.038922 2.448943 0.604036
H  6.132128 2.930086 -0.77552
H  4.88914 2.070015 -1.730873
H  6.311195 1.177654 -1.091641
